1-Butanol, 3-methyl-, nitrate

Phase change data

Data compiled as indicated in comments:
BS - Robert L. Brown and Stephen E. Stein
TRC - Thermodynamics Research Center, NIST Boulder Laboratories, Chris Muzny director
AC - William E. Acree, Jr., James S. Chickos

Quantity Value Units Method Reference Comment
Tboil421.2KN/AWeast and Grasselli, 1989BS
Tboil420. - 421.KN/AFrinton Laboratories Inc., 1986BS
Tboil422.9KN/ALecat, 1943Uncertainty assigned by TRC = 0.3 K; TRC

Enthalpy of vaporization

ΔvapH (kJ/mol) Temperature (K) Method Reference Comment
47.0293.AStephenson and Malanowski, 1987Based on data from 278. - 421. K. See also Stull, 1947.; AC

Antoine Equation Parameters

log10(P) = A − (B / (T + C))
    P = vapor pressure (bar)
    T = temperature (K)

View plot Requires a JavaScript / HTML 5 canvas capable browser.

Temperature (K) A B C Reference Comment
278.4 - 420.74.746131785.807-43.975Stull, 1947Coefficents calculated by NIST from author's data.

In addition to the Thermodynamics Research Center (TRC) data available from this site, much more physical and chemical property data is available from the following TRC products:

Normal alkane RI, non-polar column, temperature ramp

View large format table.

Column type Active phase I Reference Comment
CapillaryDB-1862.Schneider and Ballschniter, 199640. C @ 3. min, 3. K/min; Tend: 250. C

Normal alkane RI, polar column, custom temperature program

View large format table.

Column type Active phase I Reference Comment
CapillaryDB-Wax1170.Buttery and Takeoka, 2004Column length: 60. m; Column diameter: 0.25 mm; Program: not specified

References

Weast and Grasselli, 1989
CRC Handbook of Data on Organic Compounds, 2nd Editon, Weast,R.C and Grasselli, J.G., ed(s)., CRC Press, Inc., Boca Raton, FL, 1989, 1. [all data]

Frinton Laboratories Inc., 1986
Frinton Laboratories Inc., Catalog Number 11, Frinton Laboratories Inc., Vineland, NJ, 1986, 99. [all data]

Lecat, 1943
Lecat, M., Azeotropes of Ethyl Urethane and other Azeotropes, C. R. Hebd. Seances Acad. Sci., 1943, 217, 273. [all data]

Stephenson and Malanowski, 1987
Stephenson, Richard M.; Malanowski, Stanislaw, Handbook of the Thermodynamics of Organic Compounds, 1987, https://doi.org/10.1007/978-94-009-3173-2 . [all data]

Stull, 1947
Stull, Daniel R., Vapor Pressure of Pure Substances. Organic and Inorganic Compounds, Ind. Eng. Chem., 1947, 39, 4, 517-540, https://doi.org/10.1021/ie50448a022 . [all data]

Schneider and Ballschniter, 1996
Schneider, M.; Ballschniter, K., Separation of Diastereomeric and Enentiomeric Alkyl Nitrates - Systematic Approach to Chiral Discrimination on Cyclodextrin LIPODEX-D, Chem. Eur. J., 1996, 2, 5, 539-544, https://doi.org/10.1002/chem.19960020513 . [all data]

Buttery and Takeoka, 2004
Buttery, R.G.; Takeoka, G.R., Some unusual minor volatile components of tomato, J. Agric. Food Chem., 2004, 52, 20, 6246-6266, https://doi.org/10.1021/jf040176a . [all data]