ethyl-benzothiophene

Lee's RI, non-polar column, temperature ramp

Data compiled by: NIST Mass Spectrometry Data Center, William E. Wallace, director

Column type CapillaryCapillary
Active phase OV-73OV-73
Column length (m) 68.68.
Carrier gas
Substrate
Column diameter (mm) 0.280.28
Phase thickness (μm) 0.150.15
Tstart (C)
Tend (C)
Heat rate (K/min) 1.51.5
Initial hold (min)
Final hold (min)
I 235.0237.4
ReferenceArpino, Ignatiadis, et al., 1987Arpino, Ignatiadis, et al., 1987
Comment MSDC-RI MSDC-RI

References

Arpino, Ignatiadis, et al., 1987
Arpino, P.J.; Ignatiadis, I.; de Rycke, G., Sulphur-containing polynuclear aromatic hydrocarbons from petroleum. Examination of their possible statistical formation in sediments, J. Chromatogr., 1987, 390, 2, 329-348, https://doi.org/10.1016/S0021-9673(01)94385-7 . [all data]