n-Butyl mercury chloride

Gas phase ion energetics data

Data compiled as indicated in comments:
LL - Sharon G. Lias and Joel F. Liebman
LBLHLM - Sharon G. Lias, John E. Bartmess, Joel F. Liebman, John L. Holmes, Rhoda D. Levin, and W. Gary Mallard
LLK - Sharon G. Lias, Rhoda D. Levin, and Sherif A. Kafafi

Ionization energy determinations

IE (eV) Method Reference Comment
9.7 ± 0.2PINekrasov, Zagorevskii, et al., 1992LL
10.08 ± 0.05PEBaidin, Timoshenko, et al., 1985Vertical value; LBLHLM
10.08 ± 0.05PEBaidin, Chizhov, et al., 1981Vertical value; LLK

Appearance energy determinations

Ion AE (eV) Other Products MethodReferenceComment
C2H4ClHg+10.4 ± 0.2C2H5PINekrasov, Zagorevskii, et al., 1992LL

References

Nekrasov, Zagorevskii, et al., 1992
Nekrasov, Y.S.; Zagorevskii, D.V.; Mikeladze, M.S., Mass spectrometry of organomercury compounds, Organomet. Chem. USSR, 1992, 5, 237, In original 499. [all data]

Baidin, Timoshenko, et al., 1985
Baidin, V.N.; Timoshenko, M.M.; Chizhov, Y.V.; Ustynyuk, Y.A.; Kritskaya, I.I., Photoelectron spectra nad the structure of organomercury compounds, J. Organomet. Chem., 1985, 292, 55. [all data]

Baidin, Chizhov, et al., 1981
Baidin, V.N.; Chizhov, Y.V.; Timoshenko, M.M.; Sokolikova, O.K.; Grishin, Y.K.; Ustynyuk, Y.A., The photoelectron spectra of alkylmercury chlorides, J. Struct. Chem., 1981, 22, 616, In original 164. [all data]