1-Oxaspiro[2.5]oct-5-ene, 8,8-dimethyl-4-methylene-

Normal alkane RI, polar column, temperature ramp

Data compiled by: NIST Mass Spectrometry Data Center, William E. Wallace, director

Column type Capillary
Active phase Carbowax
Column length (m) 60.
Carrier gas He
Substrate
Column diameter (mm) 0.2
Phase thickness (μm) 0.25
Tstart (C) 60.
Tend (C) 250.
Heat rate (K/min) 2.
Initial hold (min) 8.
Final hold (min) 15.
I 1863.
ReferenceFerhat, Tigrine-Kordjani, et al., 2007
Comment MSDC-RI

References

Ferhat, Tigrine-Kordjani, et al., 2007
Ferhat, M.A.; Tigrine-Kordjani, N.; Chemat, S.; Meklati, B.Y.; Chemat, F., Rapid Extraction of Volatile Compounds Using a New Simultaneous Microwave Distillation: Solvent Extraction Device, Chromatographia, 2007, 65, 3-4, 217-222, https://doi.org/10.1365/s10337-006-0130-5 . [all data]