trans-Chrysanthenyl acetate

Normal alkane RI, non-polar column, temperature ramp

Data compiled by: NIST Mass Spectrometry Data Center, William E. Wallace, director

Column type CapillaryCapillaryCapillaryCapillaryCapillary
Active phase HP-5 MSHP-5MSCol-Elite 5MSDB-5NB-30
Column length (m) 30.30.30.30.30.
Carrier gas HeliumHeHeHydrogenHe
Substrate
Column diameter (mm) 0.250.250.250.250.2
Phase thickness (μm) 0.250.250.250.250.25
Tstart (C) 40.60.30.50.50.
Tend (C) 260.280.246.250.250.
Heat rate (K/min) 4.3.3.4.2.
Initial hold (min)
Final hold (min) 5.
I 1239.1233.1219.1230.1220.
ReferenceMiyazawa, Marumoto, et al., 2011Basta, Pavlovic, et al., 2007Gudaityte and Venskutonis R.P., 2007Pontes, de Olivera, et al., 2007Orav, Raal, et al., 2006
Comment MSDC-RI MSDC-RI MSDC-RI MSDC-RI MSDC-RI
Column type CapillaryCapillaryCapillaryCapillary
Active phase DB-1DB-5DB-5DB-1
Column length (m) 50.30.30.50.
Carrier gas HeHeHeN2
Substrate
Column diameter (mm) 0.220.250.250.25
Phase thickness (μm) 0.250.250.250.25
Tstart (C) 70.35.40.95.
Tend (C) 220.220.250.240.
Heat rate (K/min) 4.2.52.4.
Initial hold (min)   5.
Final hold (min)  6.20.
I 1223.1238.1236.1214.
ReferencePalá-Paúl, García-Jiménez, et al., 2004Rohloff, Mordal, et al., 2004Senatore, Rigano, et al., 2004Perez-Alonso, Velasco-Negueruela, et al., 2003
Comment MSDC-RI MSDC-RI MSDC-RI MSDC-RI

Kovats' RI, non-polar column, custom temperature program

Data compiled by: NIST Mass Spectrometry Data Center, William E. Wallace, director

Column type CapillaryCapillaryCapillary
Active phase DB-5MSOV-1DB-5
Column length (m) 30.30.30.
Carrier gas HeHe
Substrate
Column diameter (mm) 0.250.250.26
Phase thickness (μm) 0.250.250.25
Program 60C(5min) => 2C/min => 140C= 5C/min => 250C(5min)44C(4min) => 3C/min => 74C => 6C/min => 134C => 12C/min => 312Cnot specified
I 1228.1219.1235.
ReferenceTuberoso, Kowalczyk, et al., 2005El-Shazly, Dorai, et al., 2002Adams, 1998
Comment MSDC-RI MSDC-RI MSDC-RI

Van Den Dool and Kratz RI, non-polar column, custom temperature program

Data compiled by: NIST Mass Spectrometry Data Center, William E. Wallace, director

Column type CapillaryCapillary
Active phase BPX-5HP-5MS
Column length (m) 30.30.
Carrier gas  He
Substrate
Column diameter (mm) 0.250.25
Phase thickness (μm) 0.250.25
Program 35C(5min) => 3C/min => 210C => 40C/min => 240C (4min)50C (3min) => 3C/min => 200C => 6C/min => 240C
I 1246.1238.
ReferenceCardeal, da Silva, et al., 2006Akpulat, Tepe, et al., 2005
Comment MSDC-RI MSDC-RI

References

Miyazawa, Marumoto, et al., 2011
Miyazawa, M.; Marumoto, S.; Kobayashi, T.; Yoshida, S.; Utsumi, Y., Determination of characteristic components in essential oils from Wisteria braphybotrys using gas chromatography - olfactometry incremental dilution technique, Rec. Nat. Prod., 2011, 5, 3, 221-227. [all data]

Basta, Pavlovic, et al., 2007
Basta, A.; Pavlovic, M.; Couladis, M.; Tzakou, O., Essential oil composition of the flowerheads of Chrysanthemum coronarium L. from Greece, Flavour Fragr. J., 2007, 22, 3, 197-200, https://doi.org/10.1002/ffj.1781 . [all data]

Gudaityte and Venskutonis R.P., 2007
Gudaityte, O.; Venskutonis R.P., Chemotypes of Achillea millefolium transferred from 14 different locations in Lithuania to the controlled environment, Biochem. Syst. Ecol., 2007, 35, 9, 582-592, https://doi.org/10.1016/j.bse.2007.03.016 . [all data]

Pontes, de Olivera, et al., 2007
Pontes, W.J.T.; de Olivera, J.C.G.; da Camara, C.A.G.; Lopes, A.C.H.R.; Gondim Jr.; de Olivera, J.V.; Barros, R.; Schwartz, M.O.E., Chemical composition and acaridical activity of the leaf and fruit essential oils of Protium heptaphyllum (Aubl.) Marchand (Burseraceae), Acta Amazonica, 2007, 37, 1, 103-110, https://doi.org/10.1590/S0044-59672007000100012 . [all data]

Orav, Raal, et al., 2006
Orav, A.; Raal, A.; Arak, E.; Müürisepp, M.; Kailas, T., Composition of the essential oil of Artemisia absinthium L. of different geographical origin, Proc. Est. Acad. Sci. Chem., 2006, 55, 3, 155-165. [all data]

Palá-Paúl, García-Jiménez, et al., 2004
Palá-Paúl, J.; García-Jiménez, R.; Pérez-Alonso, M.J.; Velasco-Negueruela, A.; Sanz, J., Essential oil composition of the leaves and stems of Meum athamanticum Jacq., from Spain, J. Chromatogr. A, 2004, 1036, 2, 245-247, https://doi.org/10.1016/j.chroma.2004.02.064 . [all data]

Rohloff, Mordal, et al., 2004
Rohloff, J.; Mordal, R.; Dragland, S., Chemotypical variation of tansy (Tanacetum vulgare L.) from 40 different locations in Norway, J. Agric. Food Chem., 2004, 52, 6, 1742-1748, https://doi.org/10.1021/jf0352430 . [all data]

Senatore, Rigano, et al., 2004
Senatore, F.; Rigano, D.; de Fusco, R.; Bruno, M., Composition of the essential oil from flowerheads of Chrysanthemum coronarium L. (Asteraceae) growing wild in Southern Italy, Flavour Fragr. J., 2004, 19, 2, 149-152, https://doi.org/10.1002/ffj.1285 . [all data]

Perez-Alonso, Velasco-Negueruela, et al., 2003
Perez-Alonso, M.J.; Velasco-Negueruela, A.; Palá-Paúl, J.; Sanz, J., Variations in the essential oil composition of Artemisia pedemontana gathered in Spain: chemotype camphor-1,8-cineole and chemotype davanone, Biochem. Syst. Ecol., 2003, 31, 1, 77-84, https://doi.org/10.1016/S0305-1978(02)00082-0 . [all data]