8-Heptadecene

Normal alkane RI, polar column, custom temperature program

Data compiled by: NIST Mass Spectrometry Data Center, William E. Wallace, director

Column type Capillary
Active phase BP-20
Column length (m) 30.
Carrier gas He
Substrate
Column diameter (mm) 0.25
Phase thickness (μm) 0.25
Program 50C(1min) => 2.5C/min => 100C => 2C/min => 180C => 15C/min => 220C
I 1712.
ReferencePontes, Marques, et al., 2007
Comment MSDC-RI

Normal alkane RI, non-polar column, temperature ramp

Data compiled by: NIST Mass Spectrometry Data Center, William E. Wallace, director

Column type Capillary
Active phase DB-5
Column length (m) 30.
Carrier gas He
Substrate
Column diameter (mm) 0.25
Phase thickness (μm) 0.25
Tstart (C) 50.
Tend (C) 250.
Heat rate (K/min) 3.
Initial hold (min)
Final hold (min) 10.
I 1676.
ReferenceHavlik, Kokoska, et al., 2006
Comment MSDC-RI

Van Den Dool and Kratz RI, non-polar column, custom temperature program

Data compiled by: NIST Mass Spectrometry Data Center, William E. Wallace, director

Column type CapillaryCapillaryCapillaryCapillary
Active phase DB-5MSBPX-5DB-5MSDB-5MS
Column length (m) 30.30.30.30.
Carrier gas He HeHe
Substrate
Column diameter (mm) 0.320.250.320.32
Phase thickness (μm) 0.50.250.50.5
Program 70C => 5C/min => 85C(1min) => 3C/min => 165C => 10C/min => 280C(3min)35C(5min) => 3C/min => 210C => 40C/min => 240C (4min)70C(1min) => 3C/min => 80C(1min) => 5C/min => 150C => 10C/min => 280C (4min)70C(1min) => 3C/min => 80C(1min) => 5C/min => 150C => 10C/min => 280C (4min)
I 1680.1679.1680.1680.
ReferenceVarlet, Serot, et al., 2007Cardeal, da Silva, et al., 2006Varlet V., Knockaert C., et al., 2006Varlet V., Knockaert C., et al., 2006
Comment MSDC-RI MSDC-RI MSDC-RI MSDC-RI

Kovats' RI, polar column, isothermal

Data compiled by: NIST Mass Spectrometry Data Center, William E. Wallace, director

Column type CapillaryCapillary
Active phase PEG-20MCarbowax 20M
Column length (m)  300.
Carrier gas  N2
Substrate
Column diameter (mm)  0.25
Phase thickness (μm)
Temperature (C) 110.110.
I 1705.1705.3
ReferenceRang, Orav, et al., 1988Soják, Krupcík, et al., 1980
Comment MSDC-RI MSDC-RI

References

Pontes, Marques, et al., 2007
Pontes, M.; Marques, J.C.; Camara, J.S., Screening of volatile composition from Portuguese multifloral honeys using headspace solid-phase microextraction-gas chromatography-quadrupole mass spectrometry, Talanta, 2007, 74, 1, 91-103, https://doi.org/10.1016/j.talanta.2007.05.037 . [all data]