1,1-Dimethoxy-2-methylbutane

Reaction thermochemistry data

Data compiled by: Hussein Y. Afeefy, Joel F. Liebman, and Stephen E. Stein

Individual Reactions

1,1-Dimethoxy-2-methylbutane + Water = 2Methyl Alcohol + Butanal, 2-methyl-

By formula: C7H16O2 + H2O = 2CH4O + C5H10O

Quantity Value Units Method Reference Comment
Δr34.03 ± 0.14kJ/molEqkWiberg and Squires, 1981liquid phase

References

Wiberg and Squires, 1981
Wiberg, K.B.; Squires, R.R., Thermochemical studies of carbonyl reactions. 2. Steric effects in acetal and ketal hydrolysis, J. Am. Chem. Soc., 1981, 103, 4473-4478. [all data]