epi-Longipinanol

Kovats' RI, non-polar column, custom temperature program

View large format table.

Column type Active phase I Reference Comment
CapillaryHP-51560.Frizzo, Serafini, et al., 200130. m/0.32 mm/0.25 μm, H2; Program: 60 0C (8 min) 3 K/min -> 180 0C 20 K/min (20 min)

Van Den Dool and Kratz RI, non-polar column, temperature ramp

View large format table.

Column type Active phase I Reference Comment
CapillaryRTX-51561.Mondello, Zappia, et al., 200230. m/0.25 mm/0.25 μm, He, 45. C @ 6. min, 3. K/min, 300. C @ 10. min
CapillaryDB-51560.Nogueira, Bittrich, et al., 200130. m/0.25 mm/0.25 μm, H2, 3. K/min; Tstart: 60. C; Tend: 240. C

Van Den Dool and Kratz RI, non-polar column, custom temperature program

View large format table.

Column type Active phase I Reference Comment
CapillaryCBP-51556.Azevedo, Campos, et al., 200250. m/0.25 mm/0.25 μm, He; Program: 60C(2min) => 3C/min => 240C => 10C/min => 280C(10min)

Normal alkane RI, non-polar column, temperature ramp

View large format table.

Column type Active phase I Reference Comment
CapillaryDB-51567.Morteza-Semnani and Saeedi, 200530. m/0.25 mm/0.25 μm, He, 60. C @ 4. min, 4. K/min; Tend: 220. C

References

Frizzo, Serafini, et al., 2001
Frizzo, C.D.; Serafini, L.A.; Dellacassa, E.; Lorenzo, D.; Moyna, P., Essential oil of Baccharis uncinella DC. from Southern Brazil, Flavour Fragr. J., 2001, 16, 4, 286-288, https://doi.org/10.1002/ffj.998 . [all data]

Mondello, Zappia, et al., 2002
Mondello, L.; Zappia, G.; Cotroneo, A.; Bonaccorsi, I.; Chowdhury, J.U.; Yusuf, M.; Dugo, G., Studies on the essential oil-bearing plants of Bangladesh. Part VIII. Composition of some Ocimum oils O. basilicum L. var. purpurascens; O. sanctum L. green; O. sanctum L. purple; O. americanum L., citral type; O. americanum L., camphor type, Flavour Fragr. J., 2002, 17, 5, 335-340, https://doi.org/10.1002/ffj.1108 . [all data]

Nogueira, Bittrich, et al., 2001
Nogueira, P.C.L.; Bittrich, V.; Shepherd, G.J.; Lopes, A.V.; Marsaioli, A.J., The ecological and taxonomic importance of flower volatiles of Clusia species (Guttiferae), Phytochemistry, 2001, 56, 5, 443-452, https://doi.org/10.1016/S0031-9422(00)00213-2 . [all data]

Azevedo, Campos, et al., 2002
Azevedo, N.R.; Campos, I.F.P.; Ferreira, H.D.; Portes, T.A.; Seraphin, J.C.; de Paula, J.R.; Santos, S.C.; Ferri, P.H., Essential oil chemotypes in Hyptis suaveolens from Brazilian Cerrado, Biochem. Syst. Ecol., 2002, 30, 3, 205-216, https://doi.org/10.1016/S0305-1978(01)00075-8 . [all data]

Morteza-Semnani and Saeedi, 2005
Morteza-Semnani, K.; Saeedi, M., The essential oil composition of Phlomis bruguieri Desf. from Iran, Flavour Fragr. J., 2005, 20, 3, 344-346, https://doi.org/10.1002/ffj.1459 . [all data]