Dichloroborane anion

Gas phase ion energetics data

Data compiled by: John E. Bartmess

Protonation reactions

BCl2- + Hydrogen cation = dichloroborane

By formula: BCl2- + H+ = HBCl2

Quantity Value Units Method Reference Comment
Δr402. ± 24.kcal/molAcidChase Jr., Curnutt, et al., 1982gas phase; Est: from IP,EA of isoelectronic NO2, BF2, AlF2. Calc G2: 1.47 eV Baeck, Choi, et al., 1999

References

Chase Jr., Curnutt, et al., 1982
Chase Jr.; Curnutt, J.L.; Downy Jr.; McDonald, R.A.; Syverrud, A.N.; Valenzuela, E.A., JANAF Thermochemical Tables 1982 Supplement, J. Phys. Chem. Ref. Data, 1982, 11, 3, 695, https://doi.org/10.1063/1.555666 . [all data]

Baeck, Choi, et al., 1999
Baeck, K.K.; Choi, H.; Iwata, S., Theoretical study on spectroscopic properties of positive, neutral, and negative species of BCl2 and AlCl2: The stability of the negative species, J. Phys. Chem. A, 1999, 103, 34, 6772-6777, https://doi.org/10.1021/jp991072j . [all data]