1,1-Ethanediol, diacetate

Condensed phase thermochemistry data

Data compiled by: Hussein Y. Afeefy, Joel F. Liebman, and Stephen E. Stein

Quantity Value Units Method Reference Comment
Δfliquid-871.5 ± 1.0kJ/molCcbVerevkin, Peng, et al., 1996
Quantity Value Units Method Reference Comment
Δcliquid-2918.7 ± 1.0kJ/molCcbVerevkin, Peng, et al., 1996Corresponding Δfliquid = -871.5 kJ/mol (simple calculation by NIST; no Washburn corrections)

Gas phase thermochemistry data

Data compiled by: Hussein Y. Afeefy, Joel F. Liebman, and Stephen E. Stein

Quantity Value Units Method Reference Comment
Δfgas-812.6 ± 1.1kJ/molCcbVerevkin, Peng, et al., 1996

References

Verevkin, Peng, et al., 1996
Verevkin, S.P.; Peng, W.-H.; Beckhaus, H.D.; Ruchardt, C., Thermochemical study of aliphatic and phenyl-substituted germinal diacetates, Struct. Chem., 1996, 7, 397-404. [all data]