4-Aminohexanoic acid

Condensed phase thermochemistry data

Data compiled by: Hussein Y. Afeefy, Joel F. Liebman, and Stephen E. Stein

Quantity Value Units Method Reference Comment
Δcsolid-3572.7 ± 1.3kJ/molCcbStrepikheev, Skuratov, et al., 1955Reanalyzed by Cox and Pilcher, 1970, Original value = -3574. kJ/mol; At 293 °K

References

Strepikheev, Skuratov, et al., 1955
Strepikheev, A.A.; Skuratov, S.M.; Shtekher, S.M.; Muromova, R.S.; Brykina, E.P.; Kachinskaya, O.N., Mutual interaction of amino and carboxyl groups in amino acids, Dokl. Akad. Nauk SSSR, 1955, 102, 543-545. [all data]

Cox and Pilcher, 1970
Cox, J.D.; Pilcher, G., Thermochemistry of Organic and Organometallic Compounds, Academic Press, New York, 1970, 1-636. [all data]