OsF4 radical

Reaction thermochemistry data

Data compiled by: John E. Bartmess

Individual Reactions

Fluorine anion + F4Os = (Fluorine anion • F4Os)

By formula: F- + F4Os = (F- • F4Os)

Quantity Value Units Method Reference Comment
Δr364. ± 27.kJ/molTDEqKuznetsov, Korobov, et al., 1989gas phase; Fluoride Affinity: 0.2±2.6 kcal/mol < VF4

Ion clustering data

Data compiled by: John E. Bartmess

Clustering reactions

Fluorine anion + F4Os = (Fluorine anion • F4Os)

By formula: F- + F4Os = (F- • F4Os)

Quantity Value Units Method Reference Comment
Δr87.0 ± 6.4kcal/molTDEqKuznetsov, Korobov, et al., 1989gas phase; Fluoride Affinity: 0.2±2.6 kcal/mol < VF4

Gas phase ion energetics data

Data compiled by: John E. Bartmess

Electron affinity determinations

EA (eV) Method Reference Comment
3.87 ± 0.25TDEqKuznetsov, Korobov, et al., 1989VF4- + OsF4 <=> OsF4- + VF4, ΔH = -7.2±1.2 kcal/mol.

References

Kuznetsov, Korobov, et al., 1989
Kuznetsov, S.V.; Korobov, M.V.; Sidorov, L.N., Gas-Phase Negative Ion Chemistry of Platinum Metal Fluorides. III. Negative Ions of Pentafluorides., Int. J. Mass Spectrom. Ion Proc., 1989, 91, 3, 283, https://doi.org/10.1016/0168-1176(89)80083-7 . [all data]