2,5-Diethylpyridine

Van Den Dool and Kratz RI, non-polar column, temperature ramp

View large format table.

Column type Active phase I Reference Comment
CapillaryBPX-51422.Hill, Isaacs, et al., 199950. m/0.325 mm/0.5 μm, He, 20. C @ 2. min, 4. K/min, 250. C @ 10. min

References

Hill, Isaacs, et al., 1999
Hill, V.M.; Isaacs, N.S.; Ledward, D.A.; Ames, J.M., Effect of high hydrostatic pressure on the volatile components of a glucose-lysine model system, J. Agric. Food Chem., 1999, 47, 9, 3675-3681, https://doi.org/10.1021/jf990124z . [all data]