Azuleno[1,2,3-c,d]phenalene

Gas phase ion energetics data

Data compiled as indicated in comments:
LLK - Sharon G. Lias, Rhoda D. Levin, and Sherif A. Kafafi

Ionization energy determinations

IE (eV) Method Reference Comment
6.58PEGleiter, Spanget-Larsen, et al., 1976LLK
6.58PEGleiter, Spanget-Larsen, et al., 1976Vertical value; LLK

References

Gleiter, Spanget-Larsen, et al., 1976
Gleiter, R.; Spanget-Larsen, J.; Thulstrup, E.W.; Murata, I.; Nakasuji, K.; Jutz, C., 155. The electronic structure of azuleno[1,2,3-cd]phenalene and azuleno [5,6,7-cd]phenalene, a comparison, Helv. Chim. Acta, 1976, 59, 1459. [all data]