Cyclohexasiloxane, dodecamethyl-

Normal alkane RI, non-polar column, isothermal

Data compiled by: NIST Mass Spectrometry Data Center, William E. Wallace, director

Column type PackedPacked
Active phase SE-30SE-30
Column length (m) 3.53.5
Carrier gas
Substrate Chromosorb G AW DMCS (80-100 mesh)Chromosorb G AW DMCS (80-100 mesh)
Column diameter (mm)
Phase thickness (μm)
Temperature (C) 110.125.
I 1351.1346.
ReferenceGarzo and Alexander, 1971Garzo and Alexander, 1971
Comment MSDC-RI MSDC-RI

Van Den Dool and Kratz RI, non-polar column, custom temperature program

Data compiled by: NIST Mass Spectrometry Data Center, William E. Wallace, director

Column type Capillary
Active phase VF-5MS
Column length (m) 30.
Carrier gas He
Substrate
Column diameter (mm) 0.25
Phase thickness (μm) 0.25
Program Multi-step temperature program; T(initial)=60C; T(final)=270C
I 1349.9
ReferenceTret'yakov, 2007
Comment MSDC-RI

Phase change data

Data compiled as indicated in comments:
TRC - Thermodynamics Research Center, NIST Boulder Laboratories, Chris Muzny director
AC - William E. Acree, Jr., James S. Chickos

Quantity Value Units Method Reference Comment
Tfus270.KN/AAlvik and Dale, 1971Crystal phase 1 phase; Uncertainty assigned by TRC = 0.1 K; TRC

Enthalpy of vaporization

ΔvapH (kcal/mol) Temperature (K) Method Reference Comment
15.0355.AStephenson and Malanowski, 1987Based on data from 340. - 509. K. See also Ditsent, Skorokhodov, et al., 1971.; AC
13.4426.EBFlaningam, 1986Based on data from 411. - 531. K.; AC

Enthalpy of fusion

ΔfusH (kcal/mol) Temperature (K) Reference Comment
6.831269.Alvik, Dale, et al., 1971AC

In addition to the Thermodynamics Research Center (TRC) data available from this site, much more physical and chemical property data is available from the following TRC products:

Van Den Dool and Kratz RI, non-polar column, temperature ramp

View large format table.

Column type Active phase I Reference Comment
CapillaryUltra-11342.Richmond and Pombo-Villar, 199825. m/0.32 mm/0.52 μm, He, 15. K/min, 320. C @ 10. min; Tstart: 35. C

Normal alkane RI, non-polar column, temperature ramp

View large format table.

Column type Active phase I Reference Comment
CapillarySP-21001341.Fischer and Kusch, 1993He, 40. C @ 3. min, 5. K/min; Column length: 30. m; Column diameter: 0.25 mm; Tend: 280. C
CapillaryMethyl Silicone1363.Fujimoto, Ohtani, et al., 199025. m/0.25 mm/0.1 μm, He, 5. K/min; Tstart: 40. C; Tend: 350. C

Normal alkane RI, non-polar column, custom temperature program

View large format table.

Column type Active phase I Reference Comment
CapillaryUltra-11348.Kazuyoshi, Seiichi, et al., 200030. m/0.25 mm/0.50 μm; Program: 40 0C (5 min) 10 0C/min -> 200 0C 20 0C/min -> 320 0C (13 min)
CapillaryUltra-11350.Kazuyoshi, Seiichi, et al., 200030. m/0.25 mm/0.50 μm; Program: 40 0C (5 min) 10 0C/min -> 200 0C 20 0C/min -> 320 0C (13 min)
CapillaryUltra-11351.Kazuyoshi, Seiichi, et al., 200030. m/0.25 mm/0.50 μm; Program: 40 0C (5 min) 10 0C/min -> 200 0C 20 0C/min -> 320 0C (13 min)
CapillaryUltra-11353.Kazuyoshi, Seiichi, et al., 200030. m/0.25 mm/0.50 μm; Program: 40 0C (5 min) 10 0C/min -> 200 0C 20 0C/min -> 320 0C (13 min)
CapillaryUltra-11359.Kazuyoshi, Seiichi, et al., 200030. m/0.25 mm/0.50 μm; Program: 40 0C (5 min) 10 0C/min -> 200 0C 20 0C/min -> 320 0C (13 min)
CapillaryUltra-11359.Kazuyoshi, Seiichi, et al., 200030. m/0.25 mm/0.50 μm; Program: 40 0C (5 min) 10 0C/min -> 200 0C 20 0C/min -> 320 0C (13 min)
CapillaryUltra-11339.Richmond and Pombo-Villar, 199825. m/0.32 mm/0.52 μm, He; Program: not specified

References

Garzo and Alexander, 1971
Garzo, G.; Alexander, G., Gas chromatographic retention characteristics of low molecular weight linear, cyclic and polycyclic methylpolysiloxanes, Chromatographia, 1971, 4, 12, 554-560, https://doi.org/10.1007/BF02317591 . [all data]