Cyano-3,4-epithiobutane

Normal alkane RI, non-polar column, custom temperature program

Data compiled by: NIST Mass Spectrometry Data Center, William E. Wallace, director

Column type Capillary
Active phase HP-1
Column length (m) 50.
Carrier gas Helium
Substrate
Column diameter (mm) 0.20
Phase thickness (μm) 0.33
Program not specified
I 1086.
ReferenceBreme, Langle, et al., 2008
Comment MSDC-RI

References

Breme, Langle, et al., 2008
Breme, K.; Langle, S.; Fernandez, X.; Meierhenrich, U.J.; Brevard, H.; Joulain, D., Character impact odorants from Brassicaceae by aroma extracts dilution analysis (AEDA): Brassica cretica and Brassica insularis, Flavour Fragr. J., 2008, 24, 2, 88-93, https://doi.org/10.1002/ffj.1912 . [all data]