Propanoic acid ethoxymethyl ester

Gas phase thermochemistry data

Data compiled by: Hussein Y. Afeefy, Joel F. Liebman, and Stephen E. Stein

Quantity Value Units Method Reference Comment
Δfgas-617.4 ± 1.1kJ/molCcrMansson, 1974

References

Mansson, 1974
Mansson, M., Non-bonded oxygen-oxygen interaction in ethoxymethyl propionate, Acta Chem. Scand., Ser. B, 1974, 28, 905-908. [all data]