Chloroquine

Van Den Dool and Kratz RI, non-polar column, temperature ramp

Data compiled by: NIST Mass Spectrometry Data Center, William E. Wallace, director

Column type CapillaryPacked
Active phase DB-1SE-30
Column length (m) 15.1.8
Carrier gas HeN2
Substrate  Chromosorb W
Column diameter (mm) 0.32
Phase thickness (μm) 0.25
Tstart (C) 120.130.
Tend (C) 280.290.
Heat rate (K/min) 8.8.
Initial hold (min)  2.
Final hold (min) 5.8.
I 2600.2610.
ReferencePerrigo, Peel, et al., 1985Perrigo and Peel, 1981
Comment MSDC-RI MSDC-RI

Kovats' RI, non-polar column, isothermal

Data compiled by: NIST Mass Spectrometry Data Center, William E. Wallace, director

Column type PackedCapillary
Active phase SE-30SPB-1
Column length (m) 2.25.
Carrier gas N2He
Substrate 1% se-30 on Anachrom ABS(80-100mesh)
Column diameter (mm)  0.20
Phase thickness (μm)
Temperature (C) 280.250.
I 2630.2637.
ReferenceMusumarra, Scarlata, et al., 1987Lora-Tamayo, Rams, et al., 1986
Comment MSDC-RI MSDC-RI

Normal alkane RI, non-polar column, custom temperature program

Data compiled by: NIST Mass Spectrometry Data Center, William E. Wallace, director

Column type OtherOther
Active phase Methyl SiliconeMethyl Silicone
Column length (m)
Carrier gas
Substrate
Column diameter (mm)
Phase thickness (μm)
Program not specifiednot specified
I 2590.2660.
ReferenceArdrey and Moffat, 1981Ardrey and Moffat, 1981
Comment MSDC-RI MSDC-RI

References

Perrigo, Peel, et al., 1985
Perrigo, B.J.; Peel, H.W.; Ballantyne, D.J., Use of Dual-Column Fused-Silica Capillary Gas Chromatography in Combination with Detector Response Factors for Analytical Toxicology., J. Chromatogr., 1985, 341, 81-88, https://doi.org/10.1016/S0378-4347(00)84011-6 . [all data]

Perrigo and Peel, 1981
Perrigo, B.J.; Peel, H.W., The use of retention indices and temperature-programmed gas chromatography in analytical toxicology, J. Chromatogr. Sci., 1981, 19, 5, 219-226, https://doi.org/10.1093/chromsci/19.5.219 . [all data]