Butanoic acid, 3-hydroxy-, ethyl ester

Normal alkane RI, polar column, custom temperature program

Data compiled by: NIST Mass Spectrometry Data Center, William E. Wallace, director

Column type CapillaryCapillaryCapillaryCapillaryCapillary
Active phase DB-WaxDB-WaxStabilwaxDB-Wax EtrDB-Wax
Column length (m) 30.30.30.60.30.
Carrier gas HeliumHeliumHeliumHeHydrogen
Substrate
Column diameter (mm) 0.250.250.250.250.32
Phase thickness (μm) 0.250.250.250.50.50
Program not specifiednot specified35 0C 3 0C/min -> 100 0C 5 0C/min -> 240 0C (10 min)40C(3min) => 10C/min => 90C => 2C/min => 230C (37min)60 0C (3 min) 2 0C/min -> 220 0C 3 0C/min -> 245 0C (20 min)
I 1513.1514.1524.1490.1507.
ReferenceWelke, Manfroi, et al., 2012Welke, Manfroi, et al., 2012Chinnici, Guerrero, et al., 2009Loskos, Hernandez-Orte, et al., 2007Selli, 2007
Comment MSDC-RI MSDC-RI MSDC-RI MSDC-RI MSDC-RI
Column type CapillaryCapillaryCapillaryCapillaryCapillary
Active phase HP-InnowaxCarbowax 20MDB-WaxDB-WaxDB-Wax
Column length (m) 60. 30.30.30.
Carrier gas Nitrogen He
Substrate
Column diameter (mm) 0.25 0.320.250.25
Phase thickness (μm) 0.25 0.50.250.25
Program 50 0C (4 min) -> 40 0C 4 0C/min -> 220 0Cnot specified60C(2min) => 2C/min => 220C => 3C/min => 245C(20min)50C(4min) => 4C/min => 130C => 1C/min => 190C => 4C/min => 220C(20min)50C(4min) => 4C/min => 130C => 1C/min => 190C => 4C/min => 220C(20min)
I 1521.1490.1524.1522.1525.
ReferenceQuijano and Pino, 2006Vinogradov, 2004Selli, Cabaroglu, et al., 2003Mayorga, Knapp, et al., 2001Mayorga, Knapp, et al., 2001
Comment MSDC-RI MSDC-RI MSDC-RI MSDC-RI MSDC-RI

Normal alkane RI, polar column, temperature ramp

Data compiled by: NIST Mass Spectrometry Data Center, William E. Wallace, director

Column type CapillaryCapillaryCapillaryCapillaryCapillary
Active phase VF-Wax MSDB-WaxDB-WaxHP-InnowaxDB-Wax Etr
Column length (m) 60.30.30.30.30.
Carrier gas HeliumHeHeliumHeHe
Substrate
Column diameter (mm) 0.250.250.250.250.25
Phase thickness (μm) 0.250.250.250.50.25
Tstart (C) 60.40.40.40.40.
Tend (C) 220.230.250.200.220.
Heat rate (K/min) 3.4.3.2.2.
Initial hold (min) 5.2. 3.1.
Final hold (min) 25.5.20.15.10.
I 1512.1501.1524.1503.1546.
ReferenceDuarte, Dias, et al., 2010Xu, Fan, et al., 2007Berlinet, Brat, et al., 2006Komes, Ulrich, et al., 2006Perestrelo, Fernandes, et al., 2006
Comment MSDC-RI MSDC-RI MSDC-RI MSDC-RI MSDC-RI
Column type CapillaryCapillaryCapillaryCapillaryCapillary
Active phase DB-WaxDB-WaxDB-WaxDB-WaxDB-Wax
Column length (m) 60.60.25.25.30.
Carrier gas NitrogenHeHeHeHe
Substrate
Column diameter (mm) 0.320.250.250.250.25
Phase thickness (μm) 0.500.250.250.250.25
Tstart (C) 35.40.50.50.50.
Tend (C) 235.200.200.200.240.
Heat rate (K/min) 2.2.4.4.4.
Initial hold (min) 4.2.4.4.3.
Final hold (min) 30. 10.10.10.
I 1540.1508.1513.1534.1490.
ReferenceQian and Wang, 2005Umano, Hagi, et al., 2002Morales, Duque, et al., 2000Morales, Duque, et al., 2000Parada, Duque, et al., 2000
Comment MSDC-RI MSDC-RI MSDC-RI MSDC-RI MSDC-RI
Column type CapillaryCapillaryCapillaryCapillaryCapillary
Active phase DB-WaxSupelcowax-10DB-WaxDB-WaxDB-Wax
Column length (m) 30.60.30.30.60.
Carrier gas HeH2HeHeHe
Substrate
Column diameter (mm) 0.250.320.250.250.25
Phase thickness (μm) 0.250.50.250.25
Tstart (C) 50.35.50.50.50.
Tend (C) 240.250.240.240.200.
Heat rate (K/min) 4.5.4.4.3.
Initial hold (min) 3.5.3.3.
Final hold (min) 10.20.10.10.40.
I 1507.1542.1513.1530.1532.
ReferenceParada, Duque, et al., 2000Campeanu, Burcea, et al., 1998Parada and Duque, 1998Parada and Duque, 1998Wada and Shibamoto, 1997
Comment MSDC-RI MSDC-RI MSDC-RI MSDC-RI MSDC-RI
Column type CapillaryCapillaryCapillaryCapillaryCapillary
Active phase DB-WaxDB-WaxCarbowax 20MCarbowax 20MCarbowax 20M
Column length (m) 30.30.50.50.50.
Carrier gas HeHeN2N2N2
Substrate
Column diameter (mm) 0.250.250.220.220.22
Phase thickness (μm) 0.250.25
Tstart (C) 20.50.80.80.80.
Tend (C) 200.200.200.200.200.
Heat rate (K/min) 4.4.3.3.3.
Initial hold (min) 4.4.
Final hold (min) 10.10.
I 1502.1490.1515.1516.1515.
ReferenceMorales, Albarracín, et al., 1996Morales, Albarracín, et al., 1996Mihara, Tateba, et al., 1988Mihara, Tateba, et al., 1988Mihara, Tateba, et al., 1987
Comment MSDC-RI MSDC-RI MSDC-RI MSDC-RI MSDC-RI
Column type Capillary
Active phase Carbowax 20M
Column length (m) 50.
Carrier gas N2
Substrate
Column diameter (mm) 0.22
Phase thickness (μm)
Tstart (C) 80.
Tend (C) 200.
Heat rate (K/min) 3.
Initial hold (min)
Final hold (min)
I 1516.
ReferenceMihara, Tateba, et al., 1987
Comment MSDC-RI

Van Den Dool and Kratz RI, non-polar column, temperature ramp

Data compiled by: NIST Mass Spectrometry Data Center, William E. Wallace, director

Column type CapillaryCapillaryCapillaryCapillaryCapillary
Active phase HP-5DB-1HP-5HP-5MSSPB-5
Column length (m) 30.25.30.30.30.
Carrier gas He HeHeHe
Substrate
Column diameter (mm) 0.250.20.250.250.25
Phase thickness (μm) 0.250.330.250.250.25
Tstart (C) 50.50.50.60.60.
Tend (C) 250.300.250.250.250.
Heat rate (K/min) 4.4.4.4.4.
Initial hold (min) 4. 5.2.2.
Final hold (min) 10. 15.20.20.
I 945.949.943.945.945.
ReferenceQuijano, Salamanca, et al., 2007Osorio, Alarcon, et al., 2006Mahattanatawee, Goodner, et al., 2005Pino, Mesa, et al., 2005Pino, Marbot, et al., 2004
Comment MSDC-RI MSDC-RI MSDC-RI MSDC-RI MSDC-RI
Column type CapillaryCapillaryCapillaryCapillaryCapillary
Active phase DB-1CP Sil 5 CBHP-5MSSPB-5CP Sil 5 CB
Column length (m) 30.60.30.30.50.
Carrier gas HeHeHeHeHe
Substrate
Column diameter (mm) 0.250.320.250.250.32
Phase thickness (μm) 0.250.250.250.250.4
Tstart (C) 40.60.40.60.60.
Tend (C) 250.280.200.250.280.
Heat rate (K/min) 3.3.3.4.3.
Initial hold (min)  10.5.2.10.
Final hold (min) 20.60.20.20.60.
I 943.907.938.945.907.
ReferenceBrat, Rega, et al., 2003Pino, Almora, et al., 2003Kim T.H., Kim T.H., et al., 2002Pino, Marbot, et al., 2002Pino, Marbot, et al., 2001
Comment MSDC-RI MSDC-RI MSDC-RI MSDC-RI MSDC-RI
Column type CapillaryCapillaryCapillary
Active phase DB-1DB-1DB-1
Column length (m) 30.60.60.
Carrier gas H2HeHe
Substrate
Column diameter (mm) 0.320.250.25
Phase thickness (μm) 0.250.250.25
Tstart (C) 40.40.40.
Tend (C) 245.280.280.
Heat rate (K/min) 3.2.2.
Initial hold (min) 3.3.3.
Final hold (min) 20.10.10.
I 912.921.928.
ReferenceBrat, Brillouet, et al., 2000Adedeji, Hartman, et al., 1991Adedeji, Hartman, et al., 1991
Comment MSDC-RI MSDC-RI MSDC-RI

Phase change data

Data compiled as indicated in comments:
BS - Robert L. Brown and Stephen E. Stein
AC - William E. Acree, Jr., James S. Chickos

Quantity Value Units Method Reference Comment
Tboil443.2KN/AAldrich Chemical Company Inc., 1990BS
Quantity Value Units Method Reference Comment
Δvap13.4 ± 0.1kcal/molCGCTemprado and Chickos, 2005Based on data from 363. - 393. K.; AC

References

Welke, Manfroi, et al., 2012
Welke, J.E.; Manfroi, V.; Zanus, M.; Lazarotto, M.; Zini, C.A., Characterization of the volatile profile of Brazilian merlot wines through comprehensive two dimensional gas chromatography time-of-flight mass spectrometric detection, J. Chromatogr. A, 2012, 1226, 124-139, https://doi.org/10.1016/j.chroma.2012.01.002 . [all data]

Chinnici, Guerrero, et al., 2009
Chinnici, F.; Guerrero, E.D.; Sonni, F.; Natali, N.; Marin, R.N.; Riponi, C., Gas chromatography - mass spectrometry (GC-MS) characterization of volatile compounds in quality vinegars with protected Europian geographical indication, J. Agric. Food Chem., 2009, 57, 11, 4784-4792, https://doi.org/10.1021/jf804005w . [all data]

Loskos, Hernandez-Orte, et al., 2007
Loskos, N.; Hernandez-Orte, P.; Cacho, J.; Ferreira, V., Release and formation of varietal aroma compounds during alcoholic fermentation from nonfloral grape odorless flavor precursors fractions, J. Agric. Food Chem., 2007, 55, 16, 6674-6684, https://doi.org/10.1021/jf0702343 . [all data]

Selli, 2007
Selli, S., Volatile constituents of orange obtained from moro oranges (Citrus Sinensis L. Osbeck), J. Food Quality, 2007, 30, 3, 330-341, https://doi.org/10.1111/j.1745-4557.2007.00124.x . [all data]

Quijano and Pino, 2006
Quijano, C.E.; Pino, J.A., Changes in volatile constituents during the ripening of cocona (Solanum sessiliflorum Dunal) fruit, Revista CENIC Ciencias Quimicas, 2006, 37, 3, 133-136. [all data]

Vinogradov, 2004
Vinogradov, B.A., Production, composition, properties and application of essential oils, 2004, retrieved from http://viness.narod.ru. [all data]

Selli, Cabaroglu, et al., 2003
Selli, s.; Cabaroglu, T.; Canbas, A., Flavour components of orange wine made from a Turkish cv. Kozan, Int. J. Food Sci. Technol., 2003, 38, 5, 587-593, https://doi.org/10.1046/j.1365-2621.2003.00691.x . [all data]

Mayorga, Knapp, et al., 2001
Mayorga, H.; Knapp, H.; Winterhalter, P.; Duque, C., Glycosidically bound flavor compounds of cape gooseberry (Physalis peruviana L.), J. Agric. Food Chem., 2001, 49, 4, 1904-1908, https://doi.org/10.1021/jf0011743 . [all data]