Benzeneethanamine, 3,4,5-trimethoxy-

Van Den Dool and Kratz RI, non-polar column, temperature ramp

Data compiled by: NIST Mass Spectrometry Data Center, William E. Wallace, director

Column type CapillaryCapillaryCapillaryCapillaryPacked
Active phase VF-5MSDB-1DB-1SE-30SE-30
Column length (m) 30.15.15.15.1.8
Carrier gas HeHeHeHeN2
Substrate     Chromosorb W
Column diameter (mm) 0.250.320.250.25
Phase thickness (μm) 0.250.250.250.25
Tstart (C) 60.120.120.100.130.
Tend (C) 270.280.280.295.290.
Heat rate (K/min)  8.8.5.8.
Initial hold (min)     2.
Final hold (min)  5.5. 8.
I 1731.1663.1663.1657.1695.
ReferenceTretyakov, 2014Perrigo, Peel, et al., 1985Perrigo, Ballantyne, et al., 1984Anderson and Stafford, 1983Perrigo and Peel, 1981
Comment MSDC-RI MSDC-RI MSDC-RI MSDC-RI MSDC-RI

Normal alkane RI, non-polar column, temperature ramp

Data compiled by: NIST Mass Spectrometry Data Center, William E. Wallace, director

Column type PackedCapillaryCapillaryPackedPacked
Active phase SE-30BP-1BP-1SE-30SE-30
Column length (m) 2.12.12.2.2.
Carrier gas NitrogenHeHeNitrogenN2
Substrate Chromosorb G AW DMCS (80-100 mesh)  Chromosorb W AW DMS (80-100 mesh)Chromosorb W AW DMS
Column diameter (mm)  0.220.22
Phase thickness (μm)  0.250.25
Tstart (C) 100.100.120.130.130.
Tend (C) 300.295.280.290.290.
Heat rate (K/min)  5.8.8.8.
Initial hold (min)    2.2.
Final hold (min)    8.8.
I 1688.1657.1663.1695.1695.
ReferenceMHA, 9999Stowell and Wilson, 1985Stowell and Wilson, 1985Peel and Perrigo, 1976Peel and Perrigo, 1975
Comment MSDC-RI MSDC-RI MSDC-RI MSDC-RI MSDC-RI

Normal alkane RI, non-polar column, custom temperature program

Data compiled by: NIST Mass Spectrometry Data Center, William E. Wallace, director

Column type CapillaryCapillaryCapillaryOther
Active phase BP-1BP-1OV-1, SE-30, Methyl silicone, SP-2100, OV-101, DB-1, etc.Methyl Silicone
Column length (m) 12.12.50.
Carrier gas HeHeHydrogen
Substrate
Column diameter (mm) 0.220.220.32
Phase thickness (μm) 0.250.25
Program 120 0X 8 0C/min -> 270 0C 25 0C/min -> 300 0C (5 min)not specifiednot specifiednot specified
I 1664.1690.1657.1688.
ReferenceStowell and Wilson, 1985Stowell and Wilson, 1985Waggott and Davies, 1984Ardrey and Moffat, 1981
Comment MSDC-RI MSDC-RI MSDC-RI MSDC-RI

Phase change data

Data compiled by: Robert L. Brown and Stephen E. Stein

Reduced pressure boiling point

Tboil (K) Pressure (atm) Reference
453.20.016Weast and Grasselli, 1989

Gas phase ion energetics data

Data compiled by: Sharon G. Lias, Rhoda D. Levin, and Sherif A. Kafafi

Ionization energy determinations

IE (eV) Method Reference Comment
8.18 ± 0.24PEDomelsmith, Munchausen, et al., 1977Vertical value

Kovats' RI, non-polar column, isothermal

View large format table.

Column type Active phase Temperature (C) I Reference Comment
CapillaryBP-1200.1674.Japp, Gill, et al., 198725. m/0.22 mm/0.25 μm, N2
CapillaryBP-1200.1688.Japp, Gill, et al., 198725. m/0.53 mm/1. μm, N2
PackedOV-1200.1685.Berninger and Möller, 1977

Kovats' RI, non-polar column, custom temperature program

View large format table.

Column type Active phase I Reference Comment
PackedOV-1011700.McLinden and Stenhouse, 1979N2, Chromosorb W; Column length: 2. m; Program: not specified
PackedSE-301690.Moffat, Stead, et al., 1974Column length: 2. m; Program: not specified

Van Den Dool and Kratz RI, non-polar column, custom temperature program

View large format table.

Column type Active phase I Reference Comment
CapillaryBP-11664.Stowell and Wilson, 198712. m/0.22 mm/0.25 μm, He; Program: 120C => 8C/min => 270C => 25C/min => 300C

References

Tretyakov, 2014
Tretyakov, K.V., Retention Data. NIST Mass Spectrometry Data Center., NIST Mass Spectrometry Data Center, 2014. [all data]

Perrigo, Peel, et al., 1985
Perrigo, B.J.; Peel, H.W.; Ballantyne, D.J., Use of Dual-Column Fused-Silica Capillary Gas Chromatography in Combination with Detector Response Factors for Analytical Toxicology., J. Chromatogr., 1985, 341, 81-88, https://doi.org/10.1016/S0378-4347(00)84011-6 . [all data]

Perrigo, Ballantyne, et al., 1984
Perrigo, B.J.; Ballantyne, D.J.; Peel, H.W., Condierations in developing a data base for drugs on a DBI capillary column, J. Can. Soc. Forensic Sci., 1984, 17, 2, 41-49, https://doi.org/10.1080/00085030.1984.10757360 . [all data]

Anderson and Stafford, 1983
Anderson, W.H.; Stafford, D.T., Applications of capillary gas chromatography in routine toxicological analyses, J. Hi. Res. Chromatogr. Chromatogr. Comm., 1983, 6, 5, 247-254, https://doi.org/10.1002/jhrc.1240060506 . [all data]

Perrigo and Peel, 1981
Perrigo, B.J.; Peel, H.W., The use of retention indices and temperature-programmed gas chromatography in analytical toxicology, J. Chromatogr. Sci., 1981, 19, 5, 219-226, https://doi.org/10.1093/chromsci/19.5.219 . [all data]