Tantalum, bis(η5-cyclopentadienyl) dichloride

Gas phase ion energetics data

Data compiled by: Sharon G. Lias, Rhoda D. Levin, and Sherif A. Kafafi

Ionization energy determinations

IE (eV) Method Reference Comment
6.4 ± 0.1PEVan Dam, Terpstra, et al., 1981Vertical value
6.4 ± 0.1PECauletti, Clark, et al., 1980Vertical value

References

Van Dam, Terpstra, et al., 1981
Van Dam, H.; Terpstra, A.; Oskam, A.; Teuben, J.H., UV photoelectron spectra of some bent bis(η5-cyclopentadienyl)Niobium and tantalum complexes, Z. Naturforsch. B:, 1981, 36, 420. [all data]

Cauletti, Clark, et al., 1980
Cauletti, C.; Clark, J.P.; Green, J.C.; Jackson, S.E.; Fragala, I.L.; Ciliberto, E.; Coleman, A.W., Photoelectron spectra of bis-cyclopentadienyl metal dihalides, J. Electron Spectrosc. Relat. Phenom., 1980, 18, 61. [all data]