2-Methylsemibullvalene

Reaction thermochemistry data

Data compiled by: Hussein Y. Afeefy, Joel F. Liebman, and Stephen E. Stein

Individual Reactions

C9H10 = Cyclopropa[cd]pentalene, 2a,2b,4a,4b-tetrahydro-2a-methyl-

By formula: C9H10 = C9H10

Quantity Value Units Method Reference Comment
Δr1.kcal/molEqkWingard, Russell, et al., 1974liquid phase; solvent: CDCl3

References

Wingard, Russell, et al., 1974
Wingard, R.E., Jr.; Russell, R.K.; Paquette, L.A., Equilibrium imbalances arising from 2,8-bridging by aliphatic chains of the semibullvalene nucleus, J. Am. Chem. Soc., 1974, 96, 7474-7482. [all data]