2-Pentanol, propanoate

Kovats' RI, polar column, isothermal

Data compiled by: NIST Mass Spectrometry Data Center, William E. Wallace, director

Column type CapillaryCapillaryCapillaryPacked
Active phase OV-351OV-351OV-351Carbowax 20M
Column length (m) 25.25.25.2.
Carrier gas N2N2N2
Substrate    Chromosorb W
Column diameter (mm) 0.320.320.32
Phase thickness (μm)
Temperature (C) 100.60.80.100.
I 1159.1148.1145.1152.
ReferenceHaken and Korhonen, 1985Haken and Korhonen, 1985Haken and Korhonen, 1985Zarazir, Chovin, et al., 1970
Comment MSDC-RI MSDC-RI MSDC-RI MSDC-RI

Van Den Dool and Kratz RI, non-polar column, custom temperature program

Data compiled by: NIST Mass Spectrometry Data Center, William E. Wallace, director

Column type Capillary
Active phase HP-5
Column length (m) 30.
Carrier gas He
Substrate
Column diameter (mm) 0.25
Phase thickness (μm) 0.25
Program 50C => 6C/min => 100C => 4C/min => 280C
I 889.
ReferenceIsidorov, Krajewska, et al., 2001
Comment MSDC-RI

Kovats' RI, non-polar column, isothermal

View large format table.

Column type Active phase Temperature (C) I Reference Comment
CapillarySE-30100.916.Haken and Korhonen, 1985Column length: 25. m; Column diameter: 0.33 mm
CapillarySE-30120.908.Haken and Korhonen, 1985Column length: 25. m; Column diameter: 0.33 mm
CapillarySE-30140.928.Haken and Korhonen, 1985Column length: 25. m; Column diameter: 0.33 mm
CapillarySE-3060.932.Haken and Korhonen, 1985Column length: 25. m; Column diameter: 0.33 mm
CapillarySE-3080.926.Haken and Korhonen, 1985Column length: 25. m; Column diameter: 0.33 mm
PackedApiezon L120.878.Bogoslovsky, Anvaer, et al., 1978Celite 545
PackedApiezon L160.883.Bogoslovsky, Anvaer, et al., 1978Celite 545
PackedSE-30100.927.Zarazir, Chovin, et al., 1970Chromosorb W; Column length: 2. m

References

Haken and Korhonen, 1985
Haken, J.K.; Korhonen, I.O.O., Gas-liquid chromatography of homologous esters. XXIX. Propanoyl and monochlorpropanoyl esters of lower saturated branched-chain and unsaturated alcohols, J. Chromatogr., 1985, 324, 343-353, https://doi.org/10.1016/S0021-9673(01)81333-9 . [all data]

Zarazir, Chovin, et al., 1970
Zarazir, D.; Chovin, P.; Guiochon, G., Identification of hydroxylic compounds and their derivatives by gas chromatography, Chromatographia, 1970, 3, 4, 180-195, https://doi.org/10.1007/BF02269018 . [all data]