Butanoic acid, 2-methylpropyl ester

Normal alkane RI, non-polar column, custom temperature program

Data compiled by: NIST Mass Spectrometry Data Center, William E. Wallace, director

Column type CapillaryCapillaryCapillaryCapillaryCapillary
Active phase Polydimethyl siloxane with 5 % Ph groupsPolydimethyl siloxane with 5 % Ph groupsSE-30SE-30Methyl Silicone
Column length (m)
Carrier gas
Substrate
Column diameter (mm)
Phase thickness (μm)
Program not specifiednot specifiednot specifiednot specifiednot specified
I 955.958.933.941.940.
ReferenceRobinson, Adams, et al., 2012Robinson, Adams, et al., 2012Liu, Liang, et al., 2007Vinogradov, 2004Estrada and Gutierrez, 1999
Comment MSDC-RI MSDC-RI MSDC-RI MSDC-RI MSDC-RI
Column type Capillary
Active phase OV-101
Column length (m)
Carrier gas
Substrate
Column diameter (mm)
Phase thickness (μm)
Program not specified
I 939.
ReferenceShibamoto, 1987
Comment MSDC-RI

Condensed phase thermochemistry data

Data compiled by: Hussein Y. Afeefy, Joel F. Liebman, and Stephen E. Stein

Quantity Value Units Method Reference Comment
Δcliquid-4837.1kJ/molCcbSchjanberg, 1935Corresponding Δfliquid = -597.5 kJ/mol (simple calculation by NIST; no Washburn corrections)

Phase change data

Data compiled as indicated in comments:
BS - Robert L. Brown and Stephen E. Stein
TRC - Thermodynamics Research Center, NIST Boulder Laboratories, Chris Muzny director
AC - William E. Acree, Jr., James S. Chickos

Quantity Value Units Method Reference Comment
Tboil429.9 ± 0.6KAVGN/AAverage of 9 values; Individual data points
Quantity Value Units Method Reference Comment
Tc611.40KN/ABrown, 1906Uncertainty assigned by TRC = 6. K; TRC

Enthalpy of vaporization

ΔvapH (kJ/mol) Temperature (K) Method Reference Comment
41.7292.AStephenson and Malanowski, 1987Based on data from 277. - 430. K. See also Stull, 1947.; AC

Antoine Equation Parameters

log10(P) = A − (B / (T + C))
    P = vapor pressure (bar)
    T = temperature (K)

View plot Requires a JavaScript / HTML 5 canvas capable browser.

Temperature (K) A B C Reference Comment
277.8 - 430.14.756761927.291-25.089Stull, 1947Coefficents calculated by NIST from author's data.

In addition to the Thermodynamics Research Center (TRC) data available from this site, much more physical and chemical property data is available from the following TRC products:

Normal alkane RI, non-polar column, temperature ramp

Data compiled by: NIST Mass Spectrometry Data Center, William E. Wallace, director

Column type CapillaryCapillaryCapillaryCapillaryCapillary
Active phase DB-5DB-5DB-1DB-1DB-1
Column length (m) 30.30.30.30.30.
Carrier gas HeliumN2HeHeHe
Substrate
Column diameter (mm) 0.250.320.250.250.25
Phase thickness (μm) 0.250.250.250.250.25
Tstart (C) 40.40.50.50.50.
Tend (C) 250.250.240.240.240.
Heat rate (K/min) 3.4.3.3.5.
Initial hold (min) 5.2.5.5.3.
Final hold (min) 20.5.
I 961.938.935.935.935.
ReferenceCao, Li, et al., 2011Fan and Qian, 2005Shiota, 1993Shiota, 1993Shiota, 1993
Comment MSDC-RI MSDC-RI MSDC-RI MSDC-RI MSDC-RI
Column type CapillaryCapillary
Active phase DB-1OV-1
Column length (m) 30.50.
Carrier gas HeH2
Substrate
Column diameter (mm) 0.250.32
Phase thickness (μm) 0.250.52
Tstart (C) 50.30.
Tend (C) 240.
Heat rate (K/min) 5.1.
Initial hold (min) 3.
Final hold (min)
I 939.939.
ReferenceShiota, 1993Guan, Zheng, et al., 1992
Comment MSDC-RI MSDC-RI

Kovats' RI, polar column, isothermal

Data compiled by: NIST Mass Spectrometry Data Center, William E. Wallace, director

Column type CapillaryCapillaryCapillaryPackedPacked
Active phase OV-351OV-351OV-351Carbowax 20MCarbowax 20M
Column length (m) 25.25.25.3.3.
Carrier gas N2N2N2
Substrate    Chromosorb WAW (60-80 mesh)Chromosorb WAW (60-80 mesh)
Column diameter (mm) 0.320.320.32
Phase thickness (μm)
Temperature (C) 100.60.80.100.100.
I 1185.1171.1165.1139.1157.
ReferenceHaken, Madden, et al., 1985Haken, Madden, et al., 1985Haken, Madden, et al., 1985Chastrette, Heintz, et al., 1974Chastrette, Heintz, et al., 1974
Comment MSDC-RI MSDC-RI MSDC-RI MSDC-RI MSDC-RI
Column type Packed
Active phase Carbowax 20M
Column length (m) 2.
Carrier gas
Substrate Chromosorb W
Column diameter (mm)
Phase thickness (μm)
Temperature (C) 100.
I 1170.
ReferenceZarazir, Chovin, et al., 1970
Comment MSDC-RI

Kovats' RI, non-polar column, custom temperature program

Data compiled by: NIST Mass Spectrometry Data Center, William E. Wallace, director

Column type Capillary
Active phase SE-30
Column length (m)
Carrier gas
Substrate
Column diameter (mm)
Phase thickness (μm)
Program not specified
I 933.
ReferenceChretien and Dubois, 1978
Comment MSDC-RI

Normal alkane RI, non-polar column, isothermal

Data compiled by: NIST Mass Spectrometry Data Center, William E. Wallace, director

Column type Packed
Active phase SE-30
Column length (m)
Carrier gas
Substrate
Column diameter (mm)
Phase thickness (μm)
Temperature (C) 70.
I 946.
ReferenceYabumoto, Jennings, et al., 1977
Comment MSDC-RI

Normal alkane RI, polar column, custom temperature program

Data compiled by: NIST Mass Spectrometry Data Center, William E. Wallace, director

Column type CapillaryCapillaryCapillary
Active phase DB-WaxCarbowax 20MCarbowax 20M
Column length (m) 20.
Carrier gas Helium
Substrate
Column diameter (mm) 0.18
Phase thickness (μm) 0.18
Program 35 0C (1 min) 2/9 0C/min -> 100 0C 8 0C/min -> 200 0C (5 min)not specifiednot specified
I 1146.1152.1139.
ReferenceRowan, Hunt, et al., 2009Vinogradov, 2004Shibamoto, 1987
Comment MSDC-RI MSDC-RI MSDC-RI

Normal alkane RI, polar column, isothermal

Data compiled by: NIST Mass Spectrometry Data Center, William E. Wallace, director

Column type Packed
Active phase Carbowax 20M
Column length (m)
Carrier gas
Substrate
Column diameter (mm)
Phase thickness (μm)
Temperature (C) 100.
I 1158.
ReferenceYabumoto, Jennings, et al., 1977
Comment MSDC-RI

References

Robinson, Adams, et al., 2012
Robinson, A.L.; Adams, D.O.; Boss, P.K.; Heymann, H.; Solomon, P.S.; Trengove, R.D., Influence of geographic origine on the sensory characteristics and wine composition of Vitus viniferas cv. Cabernet Sauvignon wines from Australia (Supplemental data), Am. J. Enol. Vitic., 2012, 64, 4, 467-476, https://doi.org/10.5344/ajev.2012.12023 . [all data]

Liu, Liang, et al., 2007
Liu, F.; Liang, Y.; Cao, C.; Zhou, N., QSPR study of GC retention indices for saturated esters on seven stationary phases based on novel topological indices, Talanta, 2007, 72, 4, 1307-1315, https://doi.org/10.1016/j.talanta.2007.01.038 . [all data]

Vinogradov, 2004
Vinogradov, B.A., Production, composition, properties and application of essential oils, 2004, retrieved from http://viness.narod.ru. [all data]

Estrada and Gutierrez, 1999
Estrada, E.; Gutierrez, Y., Modeling chromatographic parameters by a novel graph theoretical sub-structural approach, J. Chromatogr. A, 1999, 858, 2, 187-199, https://doi.org/10.1016/S0021-9673(99)00808-0 . [all data]

Shibamoto, 1987
Shibamoto, T., Retention Indices in Essential Oil Analysis in Capillary Gas Chromatography in Essential Oil Analysis, Sandra, P.; Bicchi, C., ed(s)., Hutchig Verlag, Heidelberg, New York, 1987, 259-274. [all data]