2-Methyl-6-methyleneocta-2,7-dien-4-one

Kovats' RI, non-polar column, temperature ramp

View large format table.

Column type Active phase I Reference Comment
CapillarySE-301096.Juliani, Koroch, et al., 2002He, 4. K/min; Column length: 30. m; Column diameter: 0.25 mm; Tstart: 60. C; Tend: 240. C

Van Den Dool and Kratz RI, non-polar column, temperature ramp

View large format table.

Column type Active phase I Reference Comment
CapillaryDB-11123.Agnaniet, Makani, et al., 200530. m/0.25 mm/0.25 μm, N2, 5. K/min; Tstart: 50. C; Tend: 200. C

Van Den Dool and Kratz RI, non-polar column, custom temperature program

View large format table.

Column type Active phase I Reference Comment
CapillaryHP-5MS1152.5Andriamaharavo, 201430. m/0.25 mm/0.25 μm, He; Program: 60C (1 min) => 5 C/min => 210C => 10 C/min => 280C (15 min)

Normal alkane RI, non-polar column, temperature ramp

View large format table.

Column type Active phase I Reference Comment
CapillaryDB-51142.Chagonda and Chalchat, 200550. m/0.3 mm/0.25 μm, 2. K/min; Tstart: 60. C; Tend: 240. C
CapillaryDB-51145.Chagonda and Chalchat, 2005, 225. m/0.25 mm/0.15 μm, 40. C @ 5. min, 3. K/min; Tend: 220. C
CapillaryDB-51148.Woerdenbag, Windono, et al., 200430. m/0.249 mm/0.25 μm, He, 3. K/min; Tstart: 60. C; Tend: 300. C
CapillaryCP Sil 5 CB1176.Oyedeji, Ekundayo, et al., 200325. m/0.25 mm/0.15 μm, H2, 3. K/min; Tstart: 50. C; Tend: 230. C
CapillaryDB-51145.Kobaisy, Tellez, et al., 200230. m/0.25 mm/0.25 μm, He, 3. K/min; Tstart: 60. C; Tend: 240. C

Normal alkane RI, non-polar column, custom temperature program

View large format table.

Column type Active phase I Reference Comment
CapillarySE-301138.Vinogradov, 2004Program: not specified
CapillaryPolydimethyl siloxanes1138.Zenkevich, 1997Program: not specified

Normal alkane RI, polar column, custom temperature program

View large format table.

Column type Active phase I Reference Comment
CapillaryHP-Innowax FSC1586.Viljoen, Subramoney, et al., 200560. m/0.25 mm/0.25 μm, He; Program: 60C(10min) => 4C/min => 220C(10min) => 1C/min => 240C
CapillaryCarbowax 20M1670.Vinogradov, 2004Program: not specified

References

Juliani, Koroch, et al., 2002
Juliani, H.R., Jr.; Koroch, A.R.; Juliani, H.R.; Trippi, V.S.; Zygadlo, J.A., Intraespecific variation in leafoils of Lippia junelliana (mold.) tronc, Biochem. Syst. Ecol., 2002, 30, 2, 163-170, https://doi.org/10.1016/S0305-1978(01)00067-9 . [all data]

Agnaniet, Makani, et al., 2005
Agnaniet, H.; Makani, T.; Akagah, A.; Menut, C.; Bessière, J.M., Volatile constituents and antioxidant activity of essential oils from Lippia multiflora Mold. growing in Gabon, Flavour Fragr. J., 2005, 20, 1, 34-38, https://doi.org/10.1002/ffj.1383 . [all data]

Andriamaharavo, 2014
Andriamaharavo, N.R., Retention Data. NIST Mass Spectrometry Data Center., NIST Mass Spectrometry Data Center, 2014. [all data]

Chagonda and Chalchat, 2005
Chagonda, L.S.; Chalchat, J.-C., The essential oil of wild and cultivated Hoslundia opposita Vahl. from Zimbabwe, Flavour Fragr. J., 2005, 20, 2, 193-195, https://doi.org/10.1002/ffj.1402 . [all data]

Chagonda and Chalchat, 2005, 2
Chagonda, L.S.; Chalchat, J.-C., The essential oil of the fruit of Garcinia huillensis Welw. ex. Oliv. from Zimbabwe, Flavour Fragr. J., 2005, 20, 3, 313-315, https://doi.org/10.1002/ffj.1420 . [all data]

Woerdenbag, Windono, et al., 2004
Woerdenbag, H.J.; Windono, T.; Bos, R.; Riswan, S.; Quax, W.J., Composition of the essential oils of Kaempferia rotunda L. and Kaempferia angustifolia Roscoe rhizomes from Indonesia, Flavour Fragr. J., 2004, 19, 2, 145-148, https://doi.org/10.1002/ffj.1284 . [all data]

Oyedeji, Ekundayo, et al., 2003
Oyedeji, O.A.; Ekundayo, O.; König, W.A., Volatile leaf oil constituents of Lantana camara L. from Nigeria, Flavour Fragr. J., 2003, 18, 5, 384-386, https://doi.org/10.1002/ffj.1206 . [all data]

Kobaisy, Tellez, et al., 2002
Kobaisy, M.; Tellez, M.R.; Dayan, F.E.; Duke, S.O., Phytotoxicity and volatile constituents from leaves of Callicarpa japonica Thunb., Phytochemistry, 2002, 61, 1, 37-40, https://doi.org/10.1016/S0031-9422(02)00207-8 . [all data]

Vinogradov, 2004
Vinogradov, B.A., Production, composition, properties and application of essential oils, 2004, retrieved from http://viness.narod.ru. [all data]

Zenkevich, 1997
Zenkevich, I.G., Analytical Parameters of Components of Essential Oils for their Chromatographic and Chromato-Spectral Identificaiton. Oxsigenated derivatives of Mono- and Sesquiterpene Hydrocarbons, Rastit, Resursy (Rus.), 1997, 33, 1, 16-28. [all data]

Viljoen, Subramoney, et al., 2005
Viljoen, A.M.; Subramoney, S.; van Vuuren, S.F.; Baser, K.H.C.; Demirci, B., The composition, geographical variation and antimicrobial activity of Lippia javanica (Verbenaceae) leaf essential oils, J. Ethnopharmacol., 2005, 96, 1-2, 271-277, https://doi.org/10.1016/j.jep.2004.09.017 . [all data]