Disulfide, ethyl 1-methylethyl

Normal alkane RI, non-polar column, custom temperature program

Data compiled by: NIST Mass Spectrometry Data Center, William E. Wallace, director

Column type CapillaryCapillary
Active phase SE-30BPX-5
Column length (m)  50.
Carrier gas  Helium
Substrate
Column diameter (mm)  0.32
Phase thickness (μm)  0.50
Program not specified40 0C (5 min) 20 0C/min -> 60 0C (5 min) 4 0C/min -> 250 0C (10 min)
I 970.984.
ReferenceVinogradov, 2004Madruga, Arruda, et al., 2000
Comment MSDC-RI MSDC-RI

References

Vinogradov, 2004
Vinogradov, B.A., Production, composition, properties and application of essential oils, 2004, retrieved from http://viness.narod.ru. [all data]

Madruga, Arruda, et al., 2000
Madruga, M.S.; Arruda, S.G.B.; Narain, N.; Souza, J.G., Castration and slaughter age effects on panel assessment and aroma compounds of the mestico goat meat, Meat Sci., 2000, 56, 2, 117-125, https://doi.org/10.1016/S0309-1740(00)00025-5 . [all data]