CAS Reg. No. 53959-80-1

Reaction thermochemistry data

Data compiled by: John E. Bartmess

Individual Reactions

(CAS Reg. No. 53959-80-1 • 4294967295Methylene, difluoro-) + Methylene, difluoro- = CAS Reg. No. 53959-80-1

By formula: (CAS Reg. No. 53959-80-1 • 4294967295CF2) + CF2 = CAS Reg. No. 53959-80-1

Quantity Value Units Method Reference Comment
Δr<33.5kJ/molCIDTPaulino and Squires, 1991gas phase; Probably CF2..Cl-, non-covalent.

References

Paulino and Squires, 1991
Paulino, J.A.; Squires, R.R., Carbene Anion Complexes - Unusual Structural and Thermochemical Features of alpha-Halocarbanions in the Gas Phase, J. Am. Chem. Soc., 1991, 113, 5, 1845, https://doi.org/10.1021/ja00005a067 . [all data]