4-ethylbenzaldehyde

Van Den Dool and Kratz RI, polar column, temperature ramp

Data compiled by: NIST Mass Spectrometry Data Center, William E. Wallace, director

Column type CapillaryCapillaryCapillaryCapillaryCapillary
Active phase DB-WaxSupelcowax-10Supelcowax-10EC-WAXDB-Wax
Column length (m) 30.60.60.30.60.
Carrier gas HeHeHeHeHe
Substrate
Column diameter (mm) 0.250.250.250.320.32
Phase thickness (μm) 0.250.250.250.50.5
Tstart (C) 50.35.35.40.40.
Tend (C) 230.195.195.250.250.
Heat rate (K/min) 10.2.2.5.3.
Initial hold (min) 5.5.5.2.5.
Final hold (min) 25.90.90.10.10.
I 1730.1714.1714.1753.1735.
ReferenceFernandez-Segovia, Escriche, et al., 2006Chung, Yung, et al., 2002Chung, Yung, et al., 2001le Guen, Prost, et al., 2001le Guen, Prost, et al., 2000
Comment MSDC-RI MSDC-RI MSDC-RI MSDC-RI MSDC-RI
Column type CapillaryCapillaryCapillaryCapillary
Active phase DB-WaxDB-WaxDB-WaxDB-Wax
Column length (m) 60.60.60.60.
Carrier gas HeHeHeHe
Substrate
Column diameter (mm) 0.320.320.250.25
Phase thickness (μm) 0.50.50.250.25
Tstart (C) 40.40.50.50.
Tend (C) 250.250.230.230.
Heat rate (K/min) 4.4.3.2.
Initial hold (min) 2.2.
Final hold (min) 10.10.
I 1752.1753.1711.1719.
ReferenceLe Guen, Prost, et al., 2000Le Guen, Prost, et al., 2000Shimoda, Wu, et al., 1996Shimoda, Shigematsu, et al., 1995
Comment MSDC-RI MSDC-RI MSDC-RI MSDC-RI

Van Den Dool and Kratz RI, non-polar column, custom temperature program

Data compiled by: NIST Mass Spectrometry Data Center, William E. Wallace, director

Column type CapillaryCapillaryCapillary
Active phase DB-5MSDB-5DB-5
Column length (m) 30.30.30.
Carrier gas HeH2He
Substrate
Column diameter (mm) 0.250.250.25
Phase thickness (μm) 0.250.251.
Program 35C => 120C/min => 60C1.5C/min => 100C => 5C/min => 280C40C(5min) => 2C/min => 220C => 5C/min => 250C(15min)35C (2min) => 40C/min => 50C (1min) => 6C/min => 250C (10min)
I 1206.1155.1171.
ReferenceTurchini, Giani, et al., 2004Boulanger, Chassagne, et al., 1999Triqui and Reineccius, 1995
Comment MSDC-RI MSDC-RI MSDC-RI

Normal alkane RI, polar column, temperature ramp

Data compiled by: NIST Mass Spectrometry Data Center, William E. Wallace, director

Column type CapillaryCapillaryCapillaryCapillaryCapillary
Active phase ZB-WaxDB-WaxDB-WaxCBP-20Carbowax 20M
Column length (m) 60.60.30.25.40.
Carrier gas HeHeH2
Substrate
Column diameter (mm) 0.320.250.250.250.4
Phase thickness (μm) 0.5 0.5
Tstart (C) 40.60.50.35.50.
Tend (C) 250.220.200.200.170.
Heat rate (K/min) 3.2.3.5.4.
Initial hold (min) 2.4.10.5.10.
Final hold (min) 10. 10.
I 1735.1747.1732.1739.1712.
ReferenceWierda R.L., Fletcher G., et al., 2006Jiang and Kubota, 2004Alves and Franco, 2003Quiroz A. and Niemeyer H.M., 1998Kanasawud and Crouzet, 1990
Comment MSDC-RI MSDC-RI MSDC-RI MSDC-RI MSDC-RI

References

Fernandez-Segovia, Escriche, et al., 2006
Fernandez-Segovia, I.; Escriche, I.; Gomez-Sintes, M.; Fuentes, A.; Serra, J.A., In?uence of di?erent preservation treatments on the volatile fraction of desalted cod, Food Chem., 2006, 98, 3, 473-482, https://doi.org/10.1016/j.foodchem.2005.06.021 . [all data]

Chung, Yung, et al., 2002
Chung, H.-Y.; Yung, I.K.S.; Ma, W.C.J.; Kim, J.-S., Analysis of volatile components in frozen and dried scallops (Patinopecten yessoensis) by gas chromatography/mass spectrometry, Food Res. Int., 2002, 35, 1, 43-53, https://doi.org/10.1016/S0963-9969(01)00107-7 . [all data]

Chung, Yung, et al., 2001
Chung, H.Y.; Yung, I.K.S.; Kim, J.-S., Comparison of volatile components in dried scallops (Chlamys farreri and Patinopecten yessoensis) prepared by boiling and steaming methods, J. Agric. Food Chem., 2001, 49, 1, 192-202, https://doi.org/10.1021/jf000692a . [all data]

le Guen, Prost, et al., 2001
le Guen, S.; Prost, C.; Demaimay, M., Evaluation of the representativeness of the odor of cooked mussel extracts and the relationship between sensory descriptors and potent odorants, J. Agric. Food Chem., 2001, 49, 3, 1321-1327, https://doi.org/10.1021/jf000781n . [all data]

le Guen, Prost, et al., 2000
le Guen, S.; Prost, C.; Demaimay, M., Critical comparison of three olfactometric methods for the identification of the most potent odorants in cooked mussels (Mytilus edulis), J. Agric. Food Chem., 2000, 48, 4, 1307-1314, https://doi.org/10.1021/jf990745s . [all data]

Le Guen, Prost, et al., 2000
Le Guen, S.; Prost, C.; Demaimay, M., Characterization of odorant compounds of mussels (Mytilus edulis) according to their origin using gas chromatography-olfactometry and gas chromatography-mass spectrometry, J. Chromatogr. A, 2000, 896, 1-2, 361-371, https://doi.org/10.1016/S0021-9673(00)00729-9 . [all data]

Shimoda, Wu, et al., 1996
Shimoda, M.; Wu, Y.; Osajima, Y., Aroma compounds from aqueous solution of Haze (Rhus succedanea) honey determined by adsorptive column chromatography, J. Agric. Food Chem., 1996, 44, 12, 3913-3918, https://doi.org/10.1021/jf9601168 . [all data]

Shimoda, Shigematsu, et al., 1995
Shimoda, M.; Shigematsu, H.; Shiratsuchi, H.; Osajima, Y., Comparison of volatile compounds among different grades of green tea and their relations to odor attributes, J. Agric. Food Chem., 1995, 43, 6, 1621-1625, https://doi.org/10.1021/jf00054a038 . [all data]