2-Hexene, 3,4,4-trimethyl-

Phase change data

Data compiled by: Thermodynamics Research Center, NIST Boulder Laboratories, Chris Muzny director

Quantity Value Units Method Reference Comment
Tboil410.35KN/APomerantz, Mears, et al., 1949Uncertainty assigned by TRC = 0.4 K

In addition to the Thermodynamics Research Center (TRC) data available from this site, much more physical and chemical property data is available from the following TRC products:

References

Pomerantz, Mears, et al., 1949
Pomerantz, P.; Mears, T.W.; Howard, F.L., Separation and Identification of the Major C1 to C10 Components of Triptene Residue, J. Res. Natl. Bur. Stand. (U. S.), 1949, 42, 617-32. [all data]