Indomethacin

Kovats' RI, non-polar column, custom temperature program

Data compiled by: NIST Mass Spectrometry Data Center, William E. Wallace, director

Column type Packed
Active phase OV-101
Column length (m) 2.
Carrier gas N2
Substrate Chromosorb W
Column diameter (mm)
Phase thickness (μm)
Program not specified
I 2680.
ReferenceMcLinden and Stenhouse, 1979
Comment MSDC-RI

Normal alkane RI, non-polar column, custom temperature program

View large format table.

Column type Active phase I Reference Comment
OtherMethyl Silicone2685.Ardrey and Moffat, 1981Program: not specified

References

McLinden and Stenhouse, 1979
McLinden, V.J.; Stenhouse, A.M., A chromatography system for drug identification, Forensic Sci. Int., 1979, 13, 71-79, https://doi.org/10.1016/0379-0738(79)90265-2 . [all data]