cinnamic anhydride

Condensed phase thermochemistry data

Data compiled by: Hussein Y. Afeefy, Joel F. Liebman, and Stephen E. Stein

Quantity Value Units Method Reference Comment
Δfsolid-347.8 ± 8.4kJ/molCcbBreitenbach and Derkosch, 1951Reanalyzed by Cox and Pilcher, 1970, Original value = -346. kJ/mol
Quantity Value Units Method Reference Comment
Δcsolid-8736.2 ± 8.4kJ/molCcbBreitenbach and Derkosch, 1951Reanalyzed by Cox and Pilcher, 1970, Original value = -8735.8 kJ/mol; Corresponding Δfsolid = -347.8 kJ/mol (simple calculation by NIST; no Washburn corrections)

Phase change data

Data compiled as indicated in comments:
TRC - Thermodynamics Research Center, NIST Boulder Laboratories, Chris Muzny director
AC - William E. Acree, Jr., James S. Chickos

Quantity Value Units Method Reference Comment
Tfus370.KN/APadoa, 1919Uncertainty assigned by TRC = 1. K; TRC

Enthalpy of fusion

ΔfusH (kJ/mol) Temperature (K) Reference Comment
32.77321.2Acree, 1991AC

In addition to the Thermodynamics Research Center (TRC) data available from this site, much more physical and chemical property data is available from the following TRC products:

References

Breitenbach and Derkosch, 1951
Breitenbach, J.W.; Derkosch, J., Verbrennungswarmen von peroxyden und verwandten verbindungen sowie von polystrolen, Monatsh. Chem., 1951, 82, 177-179. [all data]

Cox and Pilcher, 1970
Cox, J.D.; Pilcher, G., Thermochemistry of Organic and Organometallic Compounds, Academic Press, New York, 1970, 1-636. [all data]

Padoa, 1919
Padoa, M., Atti Accad. Naz. Lincei, Cl. Sci. Fis., Mat. Nat., Rend., 1919, 28, 239. [all data]

Acree, 1991
Acree, William E., Thermodynamic properties of organic compounds: enthalpy of fusion and melting point temperature compilation, Thermochimica Acta, 1991, 189, 1, 37-56, https://doi.org/10.1016/0040-6031(91)87098-H . [all data]