Hexadecyl 2,4,6-trinitrobenzoate

Phase change data

Data compiled as indicated in comments:
TRC - Thermodynamics Research Center, NIST Boulder Laboratories, Chris Muzny director
AC - William E. Acree, Jr., James S. Chickos

Quantity Value Units Method Reference Comment
Tfus393.3KN/AWarren and Wilson, 1974Crystal phase 1 phase; Uncertainty assigned by TRC = 0.1 K; TRC

Enthalpy of fusion

ΔfusH (kcal/mol) Temperature (K) Method Reference Comment
7.060393.3DSCWarren and Wilson, 1974, 2AC

In addition to the Thermodynamics Research Center (TRC) data available from this site, much more physical and chemical property data is available from the following TRC products:

References

Warren and Wilson, 1974
Warren, M.D.; Wilson, W.S., The thermodynamic properties of the esters of 2,4,6-trinitrobenzoic acid, Thermochim. Acta, 1974, 10, 33. [all data]

Warren and Wilson, 1974, 2
Warren, M.D.; Wilson, W.S., The thermodynamic properties of the esters of 2,4,6-trinitrobenzoic acid, Thermochimica Acta, 1974, 10, 1, 33-38, https://doi.org/10.1016/0040-6031(74)85020-3 . [all data]