4-Thujen-2-α-yl acetate

Van Den Dool and Kratz RI, non-polar column, temperature ramp

View large format table.

Column type Active phase I Reference Comment
CapillaryHP-51291.Flamini, Tebano, et al., 200730. m/0.25 mm/0.25 μm, N2, 60. C @ 10. min, 5. K/min; Tend: 220. C
CapillaryHP-5MS1288.Saroglou, Dorizas, et al., 200630. m/0.25 mm/0.25 μm, He, 60. C @ 5. min, 4. K/min; Tend: 280. C

Normal alkane RI, non-polar column, temperature ramp

View large format table.

Column type Active phase I Reference Comment
CapillaryHP-5MS1275.Afsharypuor and Jahromy, 200330. m/0.25 mm/0.25 μm, He, 4. K/min; Tstart: 60. C; Tend: 275. C
CapillaryCBP-11277.Ly, Yamauchi, et al., 200125. m/0.25 mm/0.25 μm, Nitrogen, 50. C @ 2. min, 3. K/min; Tend: 210. C

References

Flamini, Tebano, et al., 2007
Flamini, G.; Tebano, M.; Cioni, P.L.; Ceccarini, L.; Ricci, A.S.; Longo, I., Comparison between the conventional method of extraction of essential oil of Laurus nobilis L. and a novel method which uses microwaves applied in situ, without resorting to an oven, J. Chromatogr. A, 2007, 1143, 1-2, 36-40, https://doi.org/10.1016/j.chroma.2007.01.031 . [all data]

Saroglou, Dorizas, et al., 2006
Saroglou, V.; Dorizas, N.; Kypriotakis, Z.; Skaltsa, H.D., Analysis of the essential oil composition of eight Anthemis species from Greece, J. Chromatogr. A, 2006, 1104, 1-2, 313-322, https://doi.org/10.1016/j.chroma.2005.11.087 . [all data]

Afsharypuor and Jahromy, 2003
Afsharypuor, S.; Jahromy, M.M., Constituents of the essential oil from Tanacetum lingulatum (Boiss.) Bornm., J. Essent. Oil Res., 2003, 15, 2, 74-76, https://doi.org/10.1080/10412905.2003.9712069 . [all data]

Ly, Yamauchi, et al., 2001
Ly, T.N.; Yamauchi, R.; KAto, K., Volatile components of the essential oils in Galanga (Alpina officinarum Hance) from Vietnam, Food Sci. Technol. Res., 2001, 7, 4, 303-306, https://doi.org/10.3136/fstr.7.303 . [all data]