2-Ethyl-4,5-dimethyl oxazole

Kovats' RI, polar column, isothermal

Data compiled by: NIST Mass Spectrometry Data Center, William E. Wallace, director

Column type CapillaryCapillaryCapillary
Active phase PEG-40MPEG-40MPEG-40M
Column length (m) 50.50.47.
Carrier gas HeHeHe
Substrate
Column diameter (mm) 0.300.300.30
Phase thickness (μm)  0.400.40
Temperature (C) 110.110.110.
I 1260.1260.1260.
ReferenceGolovnya, Shenderyuk, et al., 1991Zhuravleva, Shenderyuk, et al., 1990Golovnya, Shenderyuk, et al., 1989
Comment MSDC-RI MSDC-RI MSDC-RI

References

Golovnya, Shenderyuk, et al., 1991
Golovnya, R.V.; Shenderyuk, V.V.; Zhuravleva, I.L.; Yakush, E.V., Analogy of sorption properties of alkylthiazoles and alkyl-oxazoles and its use for the calculation of retention indexes in capillary gas chromatography, Zh. Anal. Khim., 1991, 46, 2, 313-319. [all data]

Zhuravleva, Shenderyuk, et al., 1990
Zhuravleva, I.L.; Shenderyuk, V.V.; Yakush, E.V.; Golovnya, R.V., Calculation of retention indexes of alkyloxazoles and alkylthiazoles in capillary chromatography, Bull. Acad. Sci. USSR, Div. Chem. Sci. (Engl. Transl.), 1990, 6, 6, 1204-1210, https://doi.org/10.1007/BF00962384 . [all data]

Golovnya, Shenderyuk, et al., 1989
Golovnya, R.V.; Shenderyuk, V.V.; Zhuravleva, I.L.; Yakush, E.V., Use of a principle of non-additivity of sorption energies for calculation of retention indices of alkyloxazoles in capillary chromatography, Zh. Anal. Khim., 1989, 44, 2037-2042. [all data]