Methyl-2-thiophene carboxylate

Phase change data

Data compiled by: William E. Acree, Jr., James S. Chickos

Quantity Value Units Method Reference Comment
Δvap13.8 ± 0.29kcal/molCRibeiro da Silva and Santos, 2009

Gas phase ion energetics data

Data compiled by: Sharon G. Lias, Rhoda D. Levin, and Sherif A. Kafafi

Ionization energy determinations

IE (eV) Method Reference Comment
9.22 ± 0.05EILinda, Marino, et al., 1971
8.98 ± 0.05PEFringuelli, Marino, et al., 1976Vertical value

References

Ribeiro da Silva and Santos, 2009
Ribeiro da Silva, Manuel A.V.; Santos, Ana Filipa L.O.M., Calorimetric study of methyl and ethyl 2-thiophenecarboxylates and ethyl 2- and 3-thiopheneacetates, The Journal of Chemical Thermodynamics, 2009, 41, 8, 926-931, https://doi.org/10.1016/j.jct.2009.03.007 . [all data]

Linda, Marino, et al., 1971
Linda, P.; Marino, G.; Pignataro, S., A comparison of sensitivities to substituent effects of five- membered heteroaromatic rings in gas phase ionization, J. Chem. Soc. B, 1971, 1585. [all data]

Fringuelli, Marino, et al., 1976
Fringuelli, F.; Marino, G.; Taticchi, A.; Distefano, G.; Colonna, F.P.; Pignataro, S., Photoelectron spectra of the α-substituted derivatives of furan, thiophen, selenophen, and tellurophen. A comparative study of the molecular orbital energies, J. Chem. Soc. Perkin Trans. 2, 1976, 276. [all data]