Gadolinium dioxide

Gas phase ion energetics data

Data compiled by: Sharon G. Lias, Rhoda D. Levin, and Sherif A. Kafafi

Ionization energy determinations

IE (eV) Method Reference
9.5 ± 1.0EIKordis and Gingerich, 1977

References

Kordis and Gingerich, 1977
Kordis, J.; Gingerich, K.A., Mass spectrometric observations of some polyatomic gaseous rare earth oxides their atomization energies, J. Chem. Phys., 1977, 66, 483. [all data]