Bicyclo[2.2.1]hept-2-en-7-ol

Normal alkane RI, non-polar column, temperature ramp

View large format table.

Column type Active phase I Reference Comment
CapillaryDB-51164.Juteau, Jerkovic, et al., 200350. m/0.2 mm/0.25 μm, He, 50. C @ 2. min, 3. K/min, 220. C @ 10. min

Normal alkane RI, polar column, temperature ramp

View large format table.

Column type Active phase I Reference Comment
CapillaryHP-20M1709.Juteau, Jerkovic, et al., 200350. m/0.2 mm/0.2 μm, He, 70. C @ 4. min, 4. K/min, 180. C @ 10. min

References

Juteau, Jerkovic, et al., 2003
Juteau, F.; Jerkovic, I.; Masotti, V.; Milos, M.; Mastelic, J.; Bessière, J.-M.; Viano, J., Composition and antimicrobial activity of the essential oil of Artemisia absinthium from Croatia and France, Planta Medica, 2003, 69, 2, 158-161, https://doi.org/10.1055/s-2003-37714 . [all data]