2-Azapentalene, 1,3-bis(dimethylamino)-

Gas phase ion energetics data

Data compiled by: Sharon G. Lias and Joel F. Liebman

Ionization energy determinations

IE (eV) Method Reference Comment
6.65PEEckert-Maksic, Gleiter, et al., 1988Vertical value

References

Eckert-Maksic, Gleiter, et al., 1988
Eckert-Maksic, M.; Gleiter, R.; Hafner, K.; Klas, H., The electronic structure of 2-azapentalenes. Photoelectron spectroscopic investigations, Chem. Ber., 1988, 121, 1219. [all data]