Aniline, m-phenethyl-

Gas phase ion energetics data

Data compiled by: Henry M. Rosenstock, Keith Draxl, Bruce W. Steiner, and John T. Herron

Appearance energy determinations

Ion AE (eV) Other Products MethodReferenceComment
C7H7+~13.?EIMcLafferty, Wachs, et al., 1970
C7H8N+11.0 ± 0.2?EIMcLafferty, Wachs, et al., 1970

References

McLafferty, Wachs, et al., 1970
McLafferty, F.W.; Wachs, T.; Lifshitz, C.; Innorta, G.; Irving, P., Substituent effects in unimolecular ion decompositions. XV. Mechanistic interpretations and the quasi-equilibrium theory, J. Am. Chem. Soc., 1970, 92, 6867. [all data]