Pyridine, 4-ethyl-2-methyl-

Phase change data

Data compiled by: Thermodynamics Research Center, NIST Boulder Laboratories, Chris Muzny director

Quantity Value Units Method Reference Comment
Tboil453.15KN/ARunge and Hummel, 1951Uncertainty assigned by TRC = 2. K

In addition to the Thermodynamics Research Center (TRC) data available from this site, much more physical and chemical property data is available from the following TRC products:

Kovats' RI, non-polar column, isothermal

View large format table.

Column type Active phase Temperature (C) I Reference Comment
CapillaryOV-101110.1026.Zhuravleva, Terenina, et al., 199040. m/0.27 mm/0.4 μm
PackedApiezon L130.1043.Shatts, Avots, et al., 1977He, Chromosorb W AW-DMCS; Column length: 2.4 m

Kovats' RI, polar column, isothermal

View large format table.

Column type Active phase Temperature (C) I Reference Comment
CapillaryPEG-40M110.1440.Zhuravleva, Terenina, et al., 199040. m/0.22 mm/0.40 μm

Normal alkane RI, non-polar column, custom temperature program

View large format table.

Column type Active phase I Reference Comment
CapillarySE-301033.Li, Gao, et al., 2000Program: not specified

References

Runge and Hummel, 1951
Runge, F.; Hummel, H., Catalytic conversion of actylene with ammonia, Chem. Tech. (Leipzig), 1951, 3, 163. [all data]

Zhuravleva, Terenina, et al., 1990
Zhuravleva, I.L.; Terenina, M.B.; Shenderyuk, V.V.; Golovnya, R.V., Capillary chromatography. Calculation of retention indices of alkylpyridines on the basis of non-equal energy contributions of identical alkyl groups, Zh. Anal. Khim., 1990, 45, 722-729. [all data]

Shatts, Avots, et al., 1977
Shatts, V.D.; Avots, A.A.; Belikov, V.A., Retention indices of alkylpyridines, Zh. Anal. Khim., 1977, 32, 4, 631-638. [all data]

Li, Gao, et al., 2000
Li, R.; Gao, S.-G.; Xiang, B.-R., Using improved BP neural network in predicting GC retention indices, Computers appl. chem. (Chinese), 2000, 17, 1-2, 113-114. [all data]