Pyridine, 3-ethyl-

Van Den Dool and Kratz RI, polar column, temperature ramp

Data compiled by: NIST Mass Spectrometry Data Center, William E. Wallace, director

Column type CapillaryCapillaryCapillary
Active phase Supelcowax-10Supelcowax-10CAM
Column length (m) 60.60.15.
Carrier gas HeHeHe
Substrate
Column diameter (mm) 0.250.250.24
Phase thickness (μm) 0.250.25
Tstart (C) 35.35.60.
Tend (C) 195.195.240.
Heat rate (K/min) 2.2.5.
Initial hold (min) 5.5.5.
Final hold (min) 90.90.21.
I 1378.1378.1369.
ReferenceChung, Yung, et al., 2002Chung, Yung, et al., 2001Premecz and Ford, 1987
Comment MSDC-RI MSDC-RI MSDC-RI

Normal alkane RI, non-polar column, custom temperature program

Data compiled by: NIST Mass Spectrometry Data Center, William E. Wallace, director

Column type CapillaryCapillaryCapillary
Active phase SLB-5MSDB-1DB-1
Column length (m) 10.60.60.
Carrier gas Helium
Substrate
Column diameter (mm) 0.180.250.25
Phase thickness (μm) 0.180.250.25
Program not specifiednot specifiednot specified
I 955.932.932.
ReferenceRisticevic, Carasek, et al., 2008Kawai, Ishida, et al., 1991Kawai, Ishida, et al., 1991
Comment MSDC-RI MSDC-RI MSDC-RI

Kovats' RI, polar column, isothermal

Data compiled by: NIST Mass Spectrometry Data Center, William E. Wallace, director

Column type PackedPackedPacked
Active phase Carbowax 20MCarbowax 20MCarbowax 20M
Column length (m) 2.2.2.
Carrier gas N2N2N2
Substrate Chromosorb W AW-DCMSChromosorb W AW-DCMSChromosorb W AW-DCMS
Column diameter (mm)
Phase thickness (μm)
Temperature (C) 100.110.90.
I 1380.1384.1372.
ReferenceBark and Wheatstone, 1974Bark and Wheatstone, 1974Bark and Wheatstone, 1974
Comment MSDC-RI MSDC-RI MSDC-RI

Normal alkane RI, polar column, custom temperature program

Data compiled by: NIST Mass Spectrometry Data Center, William E. Wallace, director

Column type CapillaryCapillaryCapillaryCapillaryCapillary
Active phase DB-WaxHP-InnowaxHP-InnowaxCarbowaxCarbowax
Column length (m) 30.60.60.
Carrier gas HydrogenHeliumHelium
Substrate
Column diameter (mm) 0.250.320.32
Phase thickness (μm) 0.250.250.25
Program 44 0C 3 0C/min -> 170 0C 8 0C/min -> 250 0C40 0C (5 min) 4 0C/min -> 60 0C (5 min) 8 0C/min -> 250 0C (3 min)not specifiednot specifiednot specified
I 1387.1384.1397.1372.1375.
ReferenceGonzalez-Rios, Suarez-Quiroz, et al., 2007Viegas and Bassoli, 2007Viegas and Bassoli, 2007Baltes and Bochmann, 1987Baltes and Bochmann, 1987
Comment MSDC-RI MSDC-RI MSDC-RI MSDC-RI MSDC-RI
Column type CapillaryCapillaryCapillaryCapillaryCapillary
Active phase CarbowaxCarbowaxCarbowaxCarbowaxCarbowax
Column length (m)
Carrier gas
Substrate
Column diameter (mm)
Phase thickness (μm)
Program not specifiednot specifiednot specifiednot specifiednot specified
I 1375.1375.1376.1377.1377.
ReferenceBaltes and Bochmann, 1987Baltes and Bochmann, 1987Baltes and Bochmann, 1987Baltes and Bochmann, 1987Baltes and Bochmann, 1987
Comment MSDC-RI MSDC-RI MSDC-RI MSDC-RI MSDC-RI

References

Chung, Yung, et al., 2002
Chung, H.-Y.; Yung, I.K.S.; Ma, W.C.J.; Kim, J.-S., Analysis of volatile components in frozen and dried scallops (Patinopecten yessoensis) by gas chromatography/mass spectrometry, Food Res. Int., 2002, 35, 1, 43-53, https://doi.org/10.1016/S0963-9969(01)00107-7 . [all data]

Chung, Yung, et al., 2001
Chung, H.Y.; Yung, I.K.S.; Kim, J.-S., Comparison of volatile components in dried scallops (Chlamys farreri and Patinopecten yessoensis) prepared by boiling and steaming methods, J. Agric. Food Chem., 2001, 49, 1, 192-202, https://doi.org/10.1021/jf000692a . [all data]

Premecz and Ford, 1987
Premecz, J.E.; Ford, M.E., Gas chromatographic separation of substituted pyridines, J. Chromatogr., 1987, 388, 23-35, https://doi.org/10.1016/S0021-9673(01)94463-2 . [all data]