Formamide,N-[2-chloro-5-(dimethylamino)phenyl]-

Gas phase ion energetics data

Data compiled by: Sharon G. Lias, Rhoda D. Levin, and Sherif A. Kafafi

Ionization energy determinations

IE (eV) Method Reference
6.7 ± 0.1EIKuschel and Grutzmacher, 1974

Appearance energy determinations

Ion AE (eV) Other Products MethodReferenceComment
C9H11N2O+9.7 ± 0.1ClEIKuschel and Grutzmacher, 1974

References

Kuschel and Grutzmacher, 1974
Kuschel, H.; Grutzmacher, H.-F., Zum mechanismus massenspektrometrischer fragmentierungsreaktionen. XI. EinfluB von substituenten auf die bildung cyclischer fragment-ionen in den massenspektren von N,N-dimethyl-N'-2-chlorphenylformamidinen und 2-chlorformaniliden, Org. Mass Spectrom., 1974, 9, 395. [all data]