SOF

Vibrational and/or electronic energy levels

Data compiled by: Marilyn E. Jacox

State:   X

Vib.
sym.
 No.   Approximate
 type of mode
 cm-1   Med.   Method   References

1 SO stretch 1215 ± 33 gas MW Endo, Saito, et al., 1981
2 Bend 396 gas MW Endo, Saito, et al., 1981
3 SF stretch 763 ± 12 gas MW Endo, Saito, et al., 1981

Additional references: Jacox, 1994, page 111

References

Endo, Saito, et al., 1981
Endo, Y.; Saito, S.; Hirota, E., Microwave spectrum, spin--rotation, and hyperfine interaction constants, dipole moment, molecular structure, and harmonic force constants of the FSO radical, J. Chem. Phys., 1981, 74, 3, 1568, https://doi.org/10.1063/1.441288 . [all data]

Jacox, 1994
Jacox, M.E., Vibrational and electronic energy levels of polyatomic transient molecules, American Chemical Society, Washington, DC, 1994, 464. [all data]