p-Mentha-1,8-dien-7-ol

Phase change data

Data compiled by: Robert L. Brown and Stephen E. Stein

Reduced pressure boiling point

Tboil (K) Pressure (bar) Reference
392.70.015Weast and Grasselli, 1989

Normal alkane RI, polar column, custom temperature program

Data compiled by: NIST Mass Spectrometry Data Center, William E. Wallace, director

Column type CapillaryCapillaryCapillaryCapillaryCapillary
Active phase HP InnowaxInnowax FSCHP-Innowax FSCHP Innowax FSPHP-Innowax FSC
Column length (m) 30.60.60.60.60.
Carrier gas NitrogenHeliumHeN2N2
Substrate
Column diameter (mm) 0.250.250.250.250.25
Phase thickness (μm) 0.250.250.250.250.25
Program 35 0C (10 min) 3 0C/min -> 205 0C 10 0C/min -> 225 0C60 0C (10 min) 4 0C/min -> 220 0C (10 min) 1 0C/min -> 240 0C60C(10min) => 4C/min => 220C(10min) => 1C/min => 240C60C(10min) => 4C/min => 220C(10min) => 1C/min => 240C60C(10min) => 4C/min => 220C(10min) => 1C/min => 240C
I 2001.2029.2029.2029.2029.
ReferenceLaribi, Kouki, et al., 2011Baser, Demirci, et al., 2009Tabanca N., Demirci B., et al., 2007Tabanca N., Demirci B., et al., 2007, 2Demirci B., Baser K.H.C., et al., 2006
Comment MSDC-RI MSDC-RI MSDC-RI MSDC-RI MSDC-RI
Column type CapillaryCapillaryCapillaryCapillaryCapillary
Active phase Innowax FSCHP-Innowax FSCHP-Innowax FSCHP-Innowax FSCHP-Innowax FSC
Column length (m) 60.60.60.60.60.
Carrier gas N2HeHeHeN2
Substrate
Column diameter (mm) 0.250.250.250.250.25
Phase thickness (μm) 0.250.250.250.250.25
Program 60C(10min) => 4C/min => 220C(10min) => 1C/min => 240C60C(10min) => 4C/min => 220C (10min) => 1C/min => 240C60(10min) => 4C/min => 220C(10min) => 1C/min => 240C60C (10min) => 4C/min => 220C (10min) => 1C/min => 240C60C(10min) => 4C/min => 220C(10min) => 1C/min => 240C
I 2029.2029.2029.2029.2029.
ReferenceIscan, Kirimer, et al., 2006Kürkçüoglu, Hüsnü Can Baser, et al., 2006Suleimenov Y.M., Atazhanova G.A., et al., 2006Demirci, Baser, et al., 2003Kaya, Demirci, et al., 2003
Comment MSDC-RI MSDC-RI MSDC-RI MSDC-RI MSDC-RI
Column type CapillaryCapillaryCapillaryCapillaryCapillary
Active phase DB-WaxInnowaxHP-InnowaxInnowax FSCInnowax
Column length (m) 30.60.60.60.60.
Carrier gas HeHeHeHeHe
Substrate
Column diameter (mm) 0.320.250.250.250.25
Phase thickness (μm) 0.50.250.250.250.25
Program 60C(2min) => 2C/min => 220C => 3C/min => 245C(20min)60C(10min) => 4C/min => 220C(10min) => 1C/min => 240C60 0C (10 min) 10 K/min -> 220 0C (10 min) 1K/min -> 240 0C60C(10min) => 4C/min => 220C(10min) => 1C/min => 240C60 0C (10 min) 4 K/min -> 220 0C (10 min) 1 K/min -> 240 0C
I 1999.2029.2029.2025.2025.
ReferenceSelli, Cabaroglu, et al., 2003Baser, Nuriddinov, et al., 2002Baser, Demirci, et al., 2001Tabanca N., Demirci F., et al., 2001Baser, Özek, et al., 2000
Comment MSDC-RI MSDC-RI MSDC-RI MSDC-RI MSDC-RI
Column type CapillaryCapillaryCapillaryCapillaryCapillary
Active phase Innowax FSCInnowaxDB-WaxSupelcowaxSupelcowax-10
Column length (m) 60.60.60.30.30.
Carrier gas Helium N2
Substrate
Column diameter (mm) 0.250.25 0.250.25
Phase thickness (μm) 0.250.250.25
Program 60 0C (10 min) 4 0C/min -> 220 0C (10 min) 1 0C/min -> 240 0C60C(10min) => 4C/min => 220C(10min) => 1C/min => 240Cnot specifiednot specifiednot specified
I 2025.2025.2016.1993.1986.
ReferenceKirimer, Tabanca, et al., 1999Baser, Kürkcüoglu, et al., 1998Weyerstahl, Marschall, et al., 1998Garneau, Bouhajib, et al., 1994Jean, Garneau, et al., 1993
Comment MSDC-RI MSDC-RI MSDC-RI MSDC-RI MSDC-RI

Normal alkane RI, polar column, temperature ramp

Data compiled by: NIST Mass Spectrometry Data Center, William E. Wallace, director

Column type CapillaryCapillaryCapillaryCapillaryCapillary
Active phase CarbowaxTC-FFAPSupelcowax-10DB-WaxDB-Wax
Column length (m) 60. 30.60.60.
Carrier gas HeHeHe
Substrate
Column diameter (mm) 0.20.250.250.250.25
Phase thickness (μm) 0.250.250.250.250.25
Tstart (C) 60.60.40.70.70.
Tend (C) 250.220.250.230.230.
Heat rate (K/min) 2.3.3.2.2.
Initial hold (min) 8. 5.2.2.
Final hold (min) 15.30.10.20.20.
I 1991.2014.1970.2004.2003.
ReferenceFerhat, Meklati, et al., 2007Kurose, Okamura, et al., 2007Vichi, Riu-Aumatell, et al., 2007Lan Phi N.T., Nishiyama C., et al., 2006Lan Phi N.T., Nishiyama C., et al., 2006
Comment MSDC-RI MSDC-RI MSDC-RI MSDC-RI MSDC-RI
Column type CapillaryCapillaryCapillaryCapillaryCapillary
Active phase DB-WaxDB-WaxInnowax FSCDB-WaxDB-Wax
Column length (m) 60.60.60.60.60.
Carrier gas N2NitrogenHeliumHeliumN2
Substrate
Column diameter (mm) 0.250.320.250.250.25
Phase thickness (μm) 0.250.50  0.25
Tstart (C) 70.35.60.70.70.
Tend (C) 230.235.220.210.230.
Heat rate (K/min) 2.2.4.2.2.
Initial hold (min) 2.4.10. 2.
Final hold (min) 20.30. 60.20.
I 2021.2040.2029.2001.1987.
ReferenceNjoroge, Koaze, et al., 2005Qian and Wang, 2005Lourens, Reddy, et al., 2004Mookdasanit, Tamura, et al., 2003Tu, Onishi, et al., 2003
Comment MSDC-RI MSDC-RI MSDC-RI MSDC-RI MSDC-RI
Column type CapillaryCapillaryCapillary
Active phase DB-WaxDB-WaxDB-Wax
Column length (m) 60.60.30.
Carrier gas N2N2He
Substrate
Column diameter (mm) 0.250.250.25
Phase thickness (μm) 0.250.250.25
Tstart (C) 70.70.50.
Tend (C) 230.230.220.
Heat rate (K/min) 2.2.4.
Initial hold (min) 2. 3.
Final hold (min) 20.
I 1985.2003.1959.
ReferenceTu, Onishi, et al., 2002Tu, Thanh, et al., 2002Weckerle, Bastl-Borrmann, et al., 2001
Comment MSDC-RI MSDC-RI MSDC-RI

Van Den Dool and Kratz RI, non-polar column, custom temperature program

Data compiled by: NIST Mass Spectrometry Data Center, William E. Wallace, director

Column type Capillary
Active phase HP-5MS
Column length (m) 30.
Carrier gas He
Substrate
Column diameter (mm) 0.25
Phase thickness (μm) 0.25
Program 60C (1 min) => 5 C/min => 210C => 10 C/min => 280C (15 min)
I 1305.
ReferenceAndriamaharavo, 2014
Comment MSDC-RI

References

Weast and Grasselli, 1989
CRC Handbook of Data on Organic Compounds, 2nd Editon, Weast,R.C and Grasselli, J.G., ed(s)., CRC Press, Inc., Boca Raton, FL, 1989, 1. [all data]