Butanoic acid, 3-hydroxy-, butyl ester

Kovats' RI, non-polar column, temperature ramp

View large format table.

Column type Active phase I Reference Comment
CapillaryOV-1011111.Morales and Duque, 1987He, 2. K/min; Column length: 25. m; Column diameter: 0.31 mm; Tstart: 60. C; Tend: 200. C

Van Den Dool and Kratz RI, non-polar column, temperature ramp

View large format table.

Column type Active phase I Reference Comment
CapillaryDB-11078.Adedeji, Hartman, et al., 199160. m/0.25 mm/0.25 μm, He, 40. C @ 3. min, 2. K/min, 280. C @ 10. min
CapillaryDB-11080.Adedeji, Hartman, et al., 199160. m/0.25 mm/0.25 μm, He, 40. C @ 3. min, 2. K/min, 280. C @ 10. min

Van Den Dool and Kratz RI, polar column, temperature ramp

View large format table.

Column type Active phase I Reference Comment
CapillaryZB-Wax1707.Ledauphin, Saint-Clair, et al., 200430. m/0.25 mm/0.15 μm, He, 35. C @ 5. min, 5. K/min, 220. C @ 10. min

Normal alkane RI, polar column, temperature ramp

View large format table.

Column type Active phase I Reference Comment
CapillarySupelcowax-101688.Girard and Lau, 199590. m/0.25 mm/0.25 μm, He, 35. C @ 20. min, 2. K/min, 220. C @ 30. min
CapillaryCarbowax 20M1678.Engel and Tressl, 19832. K/min; Column length: 50. m; Column diameter: 0.25 mm; Tstart: 70. C; Tend: 180. C

Normal alkane RI, polar column, custom temperature program

View large format table.

Column type Active phase I Reference Comment
CapillaryDB-Wax1684.Mayorga, Duque, et al., 200230. m/0.25 mm/0.25 μm, He; Program: 50C(4min) => 4C/min => 130C => 1C/min => 190C => 4C/min => 220C (20min)
CapillaryDB-Wax1678.Mayorga, Knapp, et al., 200130. m/0.25 mm/0.25 μm; Program: 50C(4min) => 4C/min => 130C => 1C/min => 190C => 4C/min => 220C(20min)
CapillaryDB-Wax1684.Mayorga, Knapp, et al., 200130. m/0.25 mm/0.25 μm; Program: 50C(4min) => 4C/min => 130C => 1C/min => 190C => 4C/min => 220C(20min)

References

Morales and Duque, 1987
Morales, A.L.; Duque, C., Aroma constituents of the fruit of the moutain papaya (Carica pubescens) from Colombia, J. Agric. Food Chem., 1987, 35, 4, 538-540, https://doi.org/10.1021/jf00076a024 . [all data]

Adedeji, Hartman, et al., 1991
Adedeji, J.; Hartman, T.G.; Rosen, R.T.; Ho, C.-T., Free and glycosidically bound aroma compounds in hog plum (Spondias mombins L.), J. Agric. Food Chem., 1991, 39, 8, 1494-1497, https://doi.org/10.1021/jf00008a025 . [all data]

Ledauphin, Saint-Clair, et al., 2004
Ledauphin, J.; Saint-Clair, J.-F.; Lablanquie, O.; Guichard, H.; Founier, N.; Guichard, E.; Barillier, D., Identification of trace volatile compounds in freshly distilled calvados and cognac using preparative separations coupled with gas chromatography-mass spectrometry, J. Agric. Food Chem., 2004, 52, 16, 5124-5134, https://doi.org/10.1021/jf040052y . [all data]

Girard and Lau, 1995
Girard, B.; Lau, O.L., Effect of maturity and storage on quality and volatile production of 'Jonagold' apples, Food Res. Int., 1995, 28, 5, 465-471, https://doi.org/10.1016/0963-9969(96)81393-7 . [all data]

Engel and Tressl, 1983
Engel, K.-H.; Tressl, R., Studies on the volatile components of two mango varieties, J. Agric. Food Chem., 1983, 31, 4, 796-801, https://doi.org/10.1021/jf00118a029 . [all data]

Mayorga, Duque, et al., 2002
Mayorga, H.; Duque, C.; Knapp, H.; Winterhalter, P., Hydroxyester disaccharides from fruits of cape gooseberry (Physalis peruviana), Phytochemistry, 2002, 59, 4, 439-445, https://doi.org/10.1016/S0031-9422(01)00467-8 . [all data]

Mayorga, Knapp, et al., 2001
Mayorga, H.; Knapp, H.; Winterhalter, P.; Duque, C., Glycosidically bound flavor compounds of cape gooseberry (Physalis peruviana L.), J. Agric. Food Chem., 2001, 49, 4, 1904-1908, https://doi.org/10.1021/jf0011743 . [all data]