(E)-1-Methyl-4-(6-methylhept-5-en-2-ylidene)cyclohex-1-ene

Normal alkane RI, non-polar column, custom temperature program

Data compiled by: NIST Mass Spectrometry Data Center, William E. Wallace, director

Column type CapillaryCapillaryCapillaryCapillaryCapillary
Active phase DB-5HP-5SLB-5 MSHP-5 MSDB-5
Column length (m) 30.30.30.30.30.
Carrier gas Helium HeliumHeliumHe
Substrate
Column diameter (mm) 0.250.320.250.250.25
Phase thickness (μm) 0.25 0.25 0.25
Program 50 0C m6 0C/min -> 140 0C 5 0C/min -> 160 0C (1 min) 10 0C/min -> 200 0Cnot specifiednot specified40 0C (10 min) 3 oC/min -> 200 0C 2 0C/min -> 220 0C35C => 4C/min => 180C => 10C/min => 250C
I 1529.1533.1531.1539.1537.
ReferenceCourtois, Paine, et al., 2009Riahi, Pourbasheer, et al., 2009Lo Presti, Sciarrone, et al., 2008Setzer, Stokes, et al., 2007Albuquerque, Canuto, et al., 2006
Comment MSDC-RI MSDC-RI MSDC-RI MSDC-RI MSDC-RI
Column type CapillaryCapillaryCapillaryCapillary
Active phase VF-5MSHP-5SE-30Methyl Silicone
Column length (m) 30.30.
Carrier gas He
Substrate
Column diameter (mm) 0.250.32
Phase thickness (μm) 0.25
Program 40C(1min) => 15C/min => 100C => 4C/min => 250C (1min)65C(1min) => 1C/min => 75C (2min) => 0.5C/min => 81C(2min) => 3C/min => 180C(7min)not specifiednot specified
I 1577.1535.1528.1528.
ReferenceXie, Sun, et al., 2006Singh, Maurya, et al., 2005Vinogradov, 2004Zenkevich, 1996
Comment MSDC-RI MSDC-RI MSDC-RI MSDC-RI

Van Den Dool and Kratz RI, polar column, temperature ramp

Data compiled by: NIST Mass Spectrometry Data Center, William E. Wallace, director

Column type CapillaryCapillaryCapillary
Active phase RTX-WaxCP-Wax 52CBCP-Wax 52CB
Column length (m) 60.50.50.
Carrier gas HeHe
Substrate
Column diameter (mm) 0.220.250.25
Phase thickness (μm) 0.250.20.2
Tstart (C) 60.32.32.
Tend (C) 230.220.220.
Heat rate (K/min) 2.1.1.
Initial hold (min)  1.1.
Final hold (min) 35.
I 1727.1737.1737.
ReferencePaolini, Muselli, et al., 2007Kjeldsen, Christensen, et al., 2003Kjeldsen, Christensen, et al., 2001
Comment MSDC-RI MSDC-RI MSDC-RI

Van Den Dool and Kratz RI, non-polar column, custom temperature program

Data compiled by: NIST Mass Spectrometry Data Center, William E. Wallace, director

Column type CapillaryCapillaryCapillary
Active phase HP-5MSBPX-5BPX-5
Column length (m) 30.30.50.
Carrier gas He He
Substrate
Column diameter (mm) 0.250.250.32
Phase thickness (μm) 0.250.250.5
Program 60C (1 min) => 5 C/min => 210C => 10 C/min => 280C (15 min)35C(5min) => 3C/min => 210C => 40C/min => 240C (4min)0C (5min) => 40C/min => 40C (2min) => 10C/min => 280C
I 1538.41523.1547.
ReferenceAndriamaharavo, 2014Cardeal, da Silva, et al., 2006Elmore, Erbahadir, et al., 1997
Comment MSDC-RI MSDC-RI MSDC-RI

References

Courtois, Paine, et al., 2009
Courtois, E.A.; Paine, C.E.; Blandinieres, P.-A.; Stien, D.; Bessiere, J.-M.; Houel, E.; Baraloto, C.; Chave, J., Diversity of the volatile organic compounds emitted by 55 species of tropical trees: a survey in French Guiana, J. Chem. Ecol., 2009, 35, 11, 1349-1362, https://doi.org/10.1007/s10886-009-9718-1 . [all data]

Riahi, Pourbasheer, et al., 2009
Riahi, S.; Pourbasheer, E.; Ganjali, M.R.; Norouzi, P., Investigation of different linear and non-linear chemometric methods for modeling of retention index of essential oil components: Concerns to support vector mashine, J. Hazard. Mat., 2009, 166, 2-3, 853-859, https://doi.org/10.1016/j.jhazmat.2008.11.097 . [all data]

Lo Presti, Sciarrone, et al., 2008
Lo Presti, M.; Sciarrone, D.; Crupi, M.C.; Costa, R.; Ragusa, S.; Dugo, G.; Mondello, L., Evaliation of the volatile and chiral composition in Pistacia lentiscus L. essential oil, Flavour Fragr. J., 2008, 23, 4, 249-257, https://doi.org/10.1002/ffj.1878 . [all data]

Setzer, Stokes, et al., 2007
Setzer, W.N.; Stokes, S.L.; Penton, A.F.; Takaku, S.; Haber, W.A.; Hansell, E.; Caffrey, C.R.; McKerrow, J.H., Cruzain inhibitory activity of leaf essential oils of neotropical Lauraceae and essential oil components, Natural Product Communications, 2007, 2, 12, 1203-1210. [all data]

Albuquerque, Canuto, et al., 2006
Albuquerque, M.R.J.R.; Canuto, K.M.; Pessoa, O.D.L.; Nunes, E.P.; Nascimento, R.F.; Silveira, E.R., Essential oil composition of Verbesina diversifolia DC, Flavour Fragr. J., 2006, 21, 4, 634-636, https://doi.org/10.1002/ffj.1632 . [all data]

Xie, Sun, et al., 2006
Xie, J.; Sun, B.; Yu, M., Constituents of top fragrance from fresh flowers of Robinia Pseudoacacia L. occurring in China, Flavour Fragr. J., 2006, 21, 5, 798-800, https://doi.org/10.1002/ffj.1720 . [all data]

Singh, Maurya, et al., 2005
Singh, G.; Maurya, S.; Catalan, C.; de Lampasona, M.P., Studies on essential oils, Part 42: chemical, antifungal, antioxidant and sprout suppressant studies on ginger essential oil and its oleoresin, Flavour Fragr. J., 2005, 20, 1, 1-6, https://doi.org/10.1002/ffj.1373 . [all data]

Vinogradov, 2004
Vinogradov, B.A., Production, composition, properties and application of essential oils, 2004, retrieved from http://viness.narod.ru. [all data]

Zenkevich, 1996
Zenkevich, I.G., Analytical Parameters of Components of Essential Oils for their Chromatographic and Chromato-Mass Spectral Identification. Mono- and Sesquiterpenes, Rastitelnye Resursy (Plant resources), 1996, 34, 1-2, 48-58. [all data]