Silane, ethenylethoxydimethyl-
- Formula: C6H14OSi
- Molecular weight: 130.2603
- IUPAC Standard InChIKey: JEWCZPTVOYXPGG-UHFFFAOYSA-N
- CAS Registry Number: 5356-83-2
- Chemical structure:

Van Den Dool and Kratz RI, non-polar column, custom temperature program

Column type | Active phase | I | Reference | Comment |
---|---|---|---|---|
Capillary | VF-5MS | 704. | Tretyakov, 2011 | 30. m/0.25 mm/0.25 μm, He; Program: Multi-step temperature program; T(initial)=60C; T(final)=270C |

Phase change data

Data compiled by: Robert L. Brown and Stephen E. Stein

Quantity Value Units Method Reference Comment
Tboil372.KN/APCR Inc., 1990

References

Tretyakov, 2011
Tretyakov, K.V.,
Retention Data. NIST Mass Spectrometry Data Center., NIST Mass Spectrometry Data Center, 2011. [all data]