γ-Asarone

Normal alkane RI, non-polar column, custom temperature program

Data compiled by: NIST Mass Spectrometry Data Center, William E. Wallace, director

Column type CapillaryCapillary
Active phase CP Sil 8 CBDB-1
Column length (m) 50.30.
Carrier gas HeliumHe
Substrate
Column diameter (mm) 0.320.25
Phase thickness (μm) 0.250.25
Program 60 0C (2 min) 5 0C/min -> 160 0C (1 min) 10 0C/min -> 280 0C (3 min)45C => 3C/min => 175C => 15C/min => 300C (10min)
I 1574.1536.
ReferenceRadusiene, Judzentiene, et al., 2007Figueiredo, Sim-Sim, et al., 2005
Comment MSDC-RI MSDC-RI

References

Radusiene, Judzentiene, et al., 2007
Radusiene, J.; Judzentiene, A.; Peciulyte, D.; Janulis, V., Essential Oil Composition and Antimicrobial Assay of Acorus calamus Leaves from Different Wild Populations, Plant Genetic Resources: Characterization and Utilization, 2007, 5, 1, 37-44, https://doi.org/10.1017/S1479262107390928 . [all data]

Figueiredo, Sim-Sim, et al., 2005
Figueiredo, A.C.; Sim-Sim, M.; Costa, M.M.; Barroso, J.G.; Pedro, L.G.; Esquível, M.G.; Gutierres, F.; Lobo, C.; Fontinha, S., Comparison of the essential oil composition of four Plagiochila species: P. bifaria, P. maderensis, P. retrorsa and P. stricta, Flavour Fragr. J., 2005, 20, 6, 703-709, https://doi.org/10.1002/ffj.1627 . [all data]