Acetic acid, dichloro-, ethyl ester

Condensed phase thermochemistry data

Data compiled as indicated in comments:
ALS - Hussein Y. Afeefy, Joel F. Liebman, and Stephen E. Stein
DH - Eugene S. Domalski and Elizabeth D. Hearing

Quantity Value Units Method Reference Comment
Δcliquid-473. ± 2.kcal/molCcbSmith, Bjellerup, et al., 1953At 291.7 °K; ALS
Δcliquid-472.2kcal/molCcbSchjanberg, 1935ALS

Constant pressure heat capacity of liquid

Cp,liquid (cal/mol*K) Temperature (K) Reference Comment
50.10298.von Reis, 1881T = 291 to 434 K.; DH

Phase change data

Data compiled as indicated in comments:
AC - William E. Acree, Jr., James S. Chickos
ALS - Hussein Y. Afeefy, Joel F. Liebman, and Stephen E. Stein

Quantity Value Units Method Reference Comment
Δvap12.1kcal/molN/AMajer and Svoboda, 1985
Δvap11.0kcal/molAStephenson and Malanowski, 1987Based on data from 283. - 430. K. See also Stull, 1947.; AC
Δvap12.09 ± 0.01kcal/molCLaynez and Wadso, 1972ALS
Δvap12.1 ± 0.02kcal/molCLaynez, Wadsö, et al., 1972AC
Δvap9.2kcal/molESchjanberg, 1935ALS

Antoine Equation Parameters

log10(P) = A − (B / (T + C))
    P = vapor pressure (atm)
    T = temperature (K)

View plot Requires a JavaScript / HTML 5 canvas capable browser.

Temperature (K) A B C Reference Comment
282.8 - 429.74.79751887.446-36.82Stull, 1947Coefficents calculated by NIST from author's data.

References

Smith, Bjellerup, et al., 1953
Smith, L.; Bjellerup, L.; Krook, S.; Westermark, H., Heats of combustion of organic chloro compounds determined by the "quartz wool" method, Acta Chem. Scand., 1953, 7, 65. [all data]

Schjanberg, 1935
Schjanberg, E., Die Verbrennungswarmen und die Refraktionsdaten einiger chlorsubstituierter Fettsauren und Ester., Z. Phys. Chem. Abt. A, 1935, 172, 197-233. [all data]

von Reis, 1881
von Reis, M.A., Die specifische Wärme flüssiger organischer Verbindungen und ihre Beziehung zu deren Moleculargewicht, Ann. Physik [3], 1881, 13, 447-464. [all data]

Majer and Svoboda, 1985
Majer, V.; Svoboda, V., Enthalpies of Vaporization of Organic Compounds: A Critical Review and Data Compilation, Blackwell Scientific Publications, Oxford, 1985, 300. [all data]

Stephenson and Malanowski, 1987
Stephenson, Richard M.; Malanowski, Stanislaw, Handbook of the Thermodynamics of Organic Compounds, 1987, https://doi.org/10.1007/978-94-009-3173-2 . [all data]

Stull, 1947
Stull, Daniel R., Vapor Pressure of Pure Substances. Organic and Inorganic Compounds, Ind. Eng. Chem., 1947, 39, 4, 517-540, https://doi.org/10.1021/ie50448a022 . [all data]

Laynez and Wadso, 1972
Laynez, J.; Wadso, I., Enthalpies of vaporization of organic compounds. IX. Some halogen substituted hydrocarbons and esters, Acta Chem. Scand., 1972, 26, 3148. [all data]

Laynez, Wadsö, et al., 1972
Laynez, José; Wadsö, Ingemar; Haug, Arne; Songstad, J.; Pilotti, Åke, Enthalpies of Vaporization of Organic Compounds. IX. Some Halogen Substituted Hydrocarbons and Esters., Acta Chem. Scand., 1972, 26, 3148-3152, https://doi.org/10.3891/acta.chem.scand.26-3148 . [all data]