C15H2F12O

Reaction thermochemistry data

Data compiled by: John E. Bartmess

Individual Reactions

C15HF12O- + Hydrogen cation = C15H2F12O

By formula: C15HF12O- + H+ = C15H2F12O

Quantity Value Units Method Reference Comment
Δr311.0 ± 2.0kcal/molIMREKoppel, Koppel, et al., 2000gas phase

References

Koppel, Koppel, et al., 2000
Koppel, I.A.; Koppel, J.; Pihl, V.; Leito, I.; Mishima, M.; Vlasov, V.M.; Yagupolskii, L.M.; Taft, R.W., Comparison of Bronsted acidities of neutral CH acids in gas phase and dimethyl sulfoxide, J. Chem. Soc. Perkin Trans., 2000, 2, 6, 1125-1133, https://doi.org/10.1039/b001792m . [all data]